{"text_format":"1","workbook":"xlsx","n_sheets":9,"sheets":["Instructions","Seeding Plan","Crop Districts","Rates","Plant Info","Mixes","Lists","Statements","Conditional_Formatting"],"not_rendered":{"charts":0,"images":22,"macros":1,"external_links":0,"defined_names":38,"comments":1,"pivot_tables":0},"unopened":[],"bounds":{"document_bytes":16777216,"sheet_cells":100000,"rows_first":2000,"rows_last":500,"rows_between":2000,"halvings":0,"cell_chars":16384,"cell_head_chars":4096},"cells_cut":0,"cells_raw":0,"read":"whole","date_system":"1900"}

{"sheet":"Instructions","index":0,"n_rows":6,"n_cols":1,"rows_kept":6,"cut":false,"hidden":false,"merged":[[5,0,5,13],[1,0,1,13]]}
[]
["Macros must be Enabled for the IR to properly function."]
[]
[]
[]
["Only the Seeding Plan worksheet has user entered data.  The Crop Districts, Rates, and Plant Info worksheets are for reference only."]

{"sheet":"Seeding Plan","index":1,"n_rows":128,"n_cols":111,"rows_kept":128,"cut":false,"hidden":false,"merged":[[118,4,118,21],[120,4,120,21],[122,4,122,21],[124,4,124,21],[116,30,116,33],[124,30,124,33],[122,30,122,33],[120,30,120,33],[118,30,118,33],[124,22,124,29],[122,22,122,29],[120,22,120,29],[118,22,118,29],[116,22,116,29],[119,22,119,29],[119,30,119,33],[1,26,1,33],[2,26,2,33],[3,26,3,33],[4,26,4,33],[5,26,5,33],[6,26,6,33],[116,4,116,21],[7,21,7,23],[1,22,1,23],[44,9,44,10],[45,9,45,10],[35,9,35,10],[36,9,36,10],[43,9,43,10],[45,11,45,12],[39,13,39,14],[37,9,37,10],[38,9,38,10],[39,9,39,10],[37,3,37,4],[38,30,38,31],[39,32,39,33],[1,24,1,25],[2,24,2,25],[3,5,3,13],[4,5,4,13],[2,14,2,21],[3,14,3,21],[4,14,4,21],[3,24,3,25],[42,11,42,12],[45,7,45,8],[42,7,42,8],[4,24,4,25],[44,11,44,12],[21,3,21,17],[5,24,5,25],[6,24,6,25],[43,3,43,4],[43,7,43,8],[43,11,43,12],[44,21,44,23],[45,21,45,23],[44,24,44,25],[45,24,45,25],[17,19,17,31],[18,2,18,5],[25,1,25,33],[124,2,124,3],[8,17,8,33],[2,22,2,23],[3,22,3,23],[4,22,4,23],[5,22,5,23],[6,22,6,23],[121,1,121,3],[121,4,121,15],[121,16,121,17],[121,18,121,21],[121,22,121,29],[121,30,121,33],[122,2,122,3],[123,1,123,3],[123,4,123,15],[123,16,123,17],[123,18,123,21],[123,22,123,29],[123,30,123,33],[119,1,119,3],[119,4,119,15],[119,16,119,17],[119,18,119,21],[120,2,120,3],[5,2,5,4],[6,2,6,4],[5,5,5,13],[6,5,6,13],[5,14,5,21],[6,14,6,21],[102,31,102,33],[102,24,102,30],[103,31,103,33],[103,24,103,30],[102,20,102,23],[103,20,103,23],[103,18,103,19],[102,18,102,19],[102,4,102,17],[103,4,103,17],[20,27,20,33],[42,13,42,14],[43,13,43,14],[44,13,44,14],[45,13,45,14],[7,2,7,7],[9,2,9,11],[126,1,126,33],[127,1,127,33],[14,1,14,6],[50,11,50,12],[51,11,51,12],[52,11,52,12],[35,11,35,12],[36,11,36,12],[37,11,37,12],[46,7,46,8],[21,19,21,33],[24,21,24,33],[23,21,23,33],[46,9,46,10],[47,9,47,10],[48,9,48,10],[49,9,49,10],[50,9,50,10],[51,9,51,10],[52,9,52,10],[60,15,60,18],[60,19,60,21],[60,22,60,25],[105,4,105,33],[39,30,39,31],[40,30,40,31],[41,30,41,31],[35,28,35,29],[36,28,36,29],[41,11,41,12],[40,28,40,29],[41,28,41,29],[20,3,20,9],[39,3,39,4],[26,1,26,33],[33,30,34,31],[33,32,34,33],[34,1,34,2],[33,3,34,4],[33,11,34,12],[33,9,34,10],[33,5,34,6],[38,11,38,12],[20,19,20,25],[41,5,41,6],[38,32,38,33],[38,3,38,4],[36,32,36,33],[41,32,41,33],[52,1,52,2],[46,5,46,6],[47,5,47,6],[48,5,48,6],[49,5,49,6],[46,3,46,4],[48,7,48,8],[49,7,49,8],[50,7,50,8],[51,7,51,8],[52,7,52,8],[52,5,52,6],[52,3,52,4],[50,5,50,6],[51,5,51,6],[46,1,46,2],[47,1,47,2],[48,1,48,2],[49,1,49,2],[49,11,49,12],[44,7,44,8],[48,24,48,25],[47,3,47,4],[48,3,48,4],[49,3,49,4],[50,3,50,4],[51,3,51,4],[43,5,43,6],[44,5,44,6],[45,1,45,2],[45,5,45,6],[44,3,44,4],[45,3,45,4],[43,1,43,2],[50,1,50,2],[51,1,51,2],[44,1,44,2],[47,7,47,8],[50,30,50,31],[50,18,50,20],[46,13,46,14],[47,13,47,14],[49,30,49,31],[48,28,48,29],[49,28,49,29],[46,28,46,29],[47,28,47,29],[48,13,48,14],[49,13,49,14],[50,13,50,14],[49,24,49,25],[50,24,50,25],[48,21,48,23],[46,24,46,25],[47,24,47,25],[50,28,50,29],[50,26,50,27],[49,15,49,17],[50,15,50,17],[50,21,50,23],[46,21,46,23],[56,11,56,12],[57,11,57,12],[44,32,44,33],[45,32,45,33],[46,32,46,33],[47,32,47,33],[48,32,48,33],[48,30,48,31],[45,26,45,27],[46,26,46,27],[47,26,47,27],[48,26,48,27],[47,30,47,31],[44,30,44,31],[45,30,45,31],[46,30,46,31],[46,11,46,12],[51,18,51,20],[51,21,51,23],[51,15,51,17],[51,26,51,27],[47,11,47,12],[48,11,48,12],[44,28,44,29],[60,11,60,12],[53,11,53,12],[54,11,54,12],[53,9,53,10],[54,9,54,10],[55,15,55,17],[58,15,58,17],[59,15,59,17],[55,13,55,14],[58,13,58,14],[53,13,53,14],[54,13,54,14],[60,13,60,14],[58,9,58,10],[59,9,59,10],[55,11,55,12],[58,11,58,12],[59,11,59,12],[56,15,56,17],[57,15,57,17],[56,13,56,14],[56,9,56,10],[57,9,57,10],[55,9,55,10],[92,12,92,17],[53,32,53,33],[54,32,54,33],[54,30,54,31],[53,7,53,8],[54,7,54,8],[53,30,53,31],[55,24,55,25],[58,24,58,25],[59,24,59,25],[53,15,53,17],[54,15,54,17],[53,18,53,20],[54,18,54,20],[91,12,91,17],[91,18,91,23],[62,1,62,33],[56,1,56,2],[57,1,57,2],[59,32,59,33],[57,28,57,29],[53,24,53,25],[54,24,54,25],[53,26,53,27],[53,5,53,6],[54,5,54,6],[38,13,38,14],[33,18,34,20],[33,15,34,17],[35,15,35,17],[36,15,36,17],[37,15,37,17],[38,15,38,17],[35,13,35,14],[36,13,36,14],[33,13,34,14],[35,18,35,20],[36,18,36,20],[37,18,37,20],[35,7,35,8],[36,7,36,8],[40,13,40,14],[41,13,41,14],[51,13,51,14],[52,15,52,17],[46,15,46,17],[47,15,47,17],[37,13,37,14],[0,31,0,33],[16,4,16,15],[15,4,15,15],[16,19,16,31],[16,17,16,18],[15,2,15,3],[16,2,16,3],[15,19,15,31],[15,17,15,18],[0,15,0,17],[0,18,0,21],[8,1,8,4],[0,22,0,24],[0,25,0,28],[10,1,10,15],[11,1,11,15],[13,1,13,33],[1,2,1,4],[1,5,1,13],[1,14,1,21],[2,2,2,4],[3,2,3,4],[4,2,4,4],[2,5,2,13],[33,21,34,23],[17,17,17,18],[32,1,32,25],[27,1,27,33],[23,15,23,20],[23,1,23,5],[23,6,23,14],[24,2,24,14],[20,1,20,2],[21,1,21,2],[20,11,20,17],[31,1,31,33],[32,26,32,33],[33,26,34,27],[33,28,34,29],[28,1,30,33],[35,32,35,33],[35,30,35,31],[39,24,39,25],[38,21,38,23],[12,1,12,33],[8,5,8,15],[0,2,0,13],[11,17,11,33],[10,17,10,33],[7,17,7,20],[0,29,0,30],[37,1,37,2],[39,28,39,29],[39,26,39,27],[38,1,38,2],[17,2,17,3],[19,1,19,3],[17,4,17,15],[39,21,39,23],[33,7,34,8],[35,5,35,6],[36,5,36,6],[37,5,37,6],[33,24,34,25],[52,28,52,29],[37,28,37,29],[36,21,36,23],[37,21,37,23],[39,18,39,20],[36,30,36,31],[37,30,37,31],[38,18,38,20],[37,32,37,33],[51,30,51,31],[43,28,43,29],[45,28,45,29],[43,18,43,20],[44,18,44,20],[45,18,45,20],[43,26,43,27],[44,26,44,27],[47,21,47,23],[49,21,49,23],[46,18,46,20],[47,18,47,20],[48,18,48,20],[49,18,49,20],[40,32,40,33],[56,18,56,20],[57,18,57,20],[57,13,57,14],[41,24,41,25],[40,26,40,27],[41,26,41,27],[35,26,35,27],[36,26,36,27],[37,26,37,27],[38,26,38,27],[35,24,35,25],[36,24,36,25],[37,24,37,25],[38,24,38,25],[52,21,52,23],[41,15,41,17],[43,15,43,17],[44,15,44,17],[45,15,45,17],[48,15,48,17],[59,13,59,14],[56,32,56,33],[57,32,57,33],[56,30,56,31],[42,32,42,33],[42,21,42,23],[42,26,42,27],[42,30,42,31],[42,28,42,29],[52,18,52,20],[52,13,52,14],[49,32,49,33],[50,32,50,33],[51,32,51,33],[52,32,52,33],[51,28,51,29],[51,24,51,25],[52,24,52,25],[54,26,54,27],[49,26,49,27],[52,30,52,31],[52,26,52,27],[55,32,55,33],[58,32,58,33],[53,3,53,4],[54,3,54,4],[59,26,59,27],[55,28,55,29],[58,28,58,29],[59,28,59,29],[55,30,55,31],[58,30,58,31],[59,30,59,31],[57,26,57,27],[59,18,59,20],[55,21,55,23],[58,21,58,23],[59,21,59,23],[56,5,56,6],[57,5,57,6],[57,30,57,31],[59,5,59,6],[56,7,56,8],[57,7,57,8],[56,24,56,25],[57,24,57,25],[56,21,56,23],[57,21,57,23],[116,2,116,3],[63,2,63,3],[63,4,63,7],[63,8,63,11],[63,12,63,15],[63,16,63,19],[63,20,63,23],[63,28,63,31],[63,32,63,33],[101,1,101,15],[100,1,100,33],[90,12,90,17],[63,24,63,27],[103,1,103,3],[106,4,106,33],[90,1,90,11],[92,1,92,11],[91,1,91,11],[102,1,102,3],[112,26,112,33],[109,4,109,33],[110,4,110,33],[115,16,115,17],[115,18,115,21],[115,22,115,29],[115,4,115,15],[115,1,115,3],[112,24,112,25],[115,30,115,33],[114,4,114,33],[111,4,111,33],[112,4,112,23],[112,1,112,3],[114,1,114,3],[117,1,117,3],[117,4,117,15],[117,16,117,17],[117,18,117,21],[117,22,117,29],[117,30,117,33],[118,2,118,3],[35,106,35,107],[35,108,35,109],[37,91,37,92],[37,93,37,95],[37,96,37,98],[35,104,35,105],[35,91,35,92],[35,93,35,95],[35,96,35,98],[37,99,37,101],[37,102,37,103],[37,104,37,105],[37,106,37,107],[37,108,37,109],[39,106,39,107],[39,108,39,109],[41,91,41,92],[35,110,35,111],[36,79,36,80],[36,81,36,82],[36,83,36,84],[36,85,36,86],[36,87,36,88],[36,89,36,90],[36,91,36,92],[36,93,36,95],[36,96,36,98],[36,99,36,101],[36,102,36,103],[36,104,36,105],[36,106,36,107],[36,108,36,109],[36,110,36,111],[35,79,35,80],[35,81,35,82],[35,83,35,84],[35,85,35,86],[35,87,35,88],[35,89,35,90],[35,99,35,101],[35,102,35,103],[37,110,37,111],[38,79,38,80],[38,81,38,82],[38,83,38,84],[38,85,38,86],[38,87,38,88],[38,89,38,90],[38,91,38,92],[38,93,38,95],[38,96,38,98],[38,99,38,101],[38,102,38,103],[38,104,38,105],[38,106,38,107],[38,108,38,109],[38,110,38,111],[37,79,37,80],[37,81,37,82],[37,83,37,84],[37,85,37,86],[37,87,37,88],[37,89,37,90],[39,110,39,111],[40,79,40,80],[40,81,40,82],[40,83,40,84],[40,85,40,86],[40,87,40,88],[40,89,40,90],[40,91,40,92],[40,93,40,95],[40,96,40,98],[40,99,40,101],[40,102,40,103],[40,104,40,105],[40,106,40,107],[40,108,40,109],[40,110,40,111],[39,79,39,80],[39,81,39,82],[39,83,39,84],[39,85,39,86],[39,87,39,88],[39,89,39,90],[41,93,41,95],[41,96,41,98],[39,99,39,101],[39,102,39,103],[39,104,39,105],[39,91,39,92],[39,93,39,95],[39,96,39,98],[41,99,41,101],[41,102,41,103],[41,104,41,105],[41,106,41,107],[41,108,41,109],[41,110,41,111],[42,79,42,80],[42,81,42,82],[42,83,42,84],[42,85,42,86],[42,87,42,88],[42,89,42,90],[42,91,42,92],[42,93,42,95],[42,96,42,98],[42,99,42,101],[42,102,42,103],[42,104,42,105],[42,106,42,107],[42,108,42,109],[42,110,42,111],[41,79,41,80],[41,81,41,82],[41,83,41,84],[41,85,41,86],[41,87,41,88],[41,89,41,90],[43,106,43,107],[43,108,43,109],[43,110,43,111],[44,79,44,80],[44,81,44,82],[44,83,44,84],[44,85,44,86],[44,87,44,88],[44,89,44,90],[44,91,44,92],[44,93,44,95],[44,96,44,98],[44,99,44,101],[44,102,44,103],[44,104,44,105],[44,106,44,107],[44,108,44,109],[44,110,44,111],[43,79,43,80],[43,81,43,82],[43,83,43,84],[43,85,43,86],[43,87,43,88],[43,89,43,90],[45,91,45,92],[45,93,45,95],[45,96,45,98],[43,99,43,101],[43,102,43,103],[43,104,43,105],[43,91,43,92],[43,93,43,95],[43,96,43,98],[45,99,45,101],[45,102,45,103],[45,104,45,105],[45,106,45,107],[45,108,45,109],[45,110,45,111],[46,79,46,80],[46,81,46,82],[46,83,46,84],[46,85,46,86],[46,87,46,88],[46,89,46,90],[46,91,46,92],[46,93,46,95],[46,96,46,98],[46,99,46,101],[46,102,46,103],[46,104,46,105],[46,106,46,107],[46,108,46,109],[46,110,46,111],[45,79,45,80],[45,81,45,82],[45,83,45,84],[45,85,45,86],[45,87,45,88],[45,89,45,90],[47,106,47,107],[47,108,47,109],[47,110,47,111],[48,79,48,80],[48,81,48,82],[48,83,48,84],[48,85,48,86],[48,87,48,88],[48,89,48,90],[48,91,48,92],[48,93,48,95],[48,96,48,98],[48,99,48,101],[48,102,48,103],[48,104,48,105],[48,106,48,107],[48,108,48,109],[48,110,48,111],[47,79,47,80],[47,81,47,82],[47,83,47,84],[47,85,47,86],[47,87,47,88],[47,89,47,90],[49,91,49,92],[49,93,49,95],[49,96,49,98],[47,99,47,101],[47,102,47,103],[47,104,47,105],[47,91,47,92],[47,93,47,95],[47,96,47,98],[49,99,49,101],[49,102,49,103],[49,104,49,105],[49,106,49,107],[49,108,49,109],[49,110,49,111],[50,79,50,80],[50,81,50,82],[50,83,50,84],[50,85,50,86],[50,87,50,88],[50,89,50,90],[50,91,50,92],[50,93,50,95],[50,96,50,98],[50,99,50,101],[50,102,50,103],[50,104,50,105],[50,106,50,107],[50,108,50,109],[50,110,50,111],[49,79,49,80],[49,81,49,82],[49,83,49,84],[49,85,49,86],[49,87,49,88],[49,89,49,90],[51,106,51,107],[51,108,51,109],[51,110,51,111],[52,79,52,80],[52,81,52,82],[52,83,52,84],[52,85,52,86],[52,87,52,88],[52,89,52,90],[52,91,52,92],[52,93,52,95],[52,96,52,98],[52,99,52,101],[52,102,52,103],[52,104,52,105],[52,106,52,107],[52,108,52,109],[52,110,52,111],[51,79,51,80],[51,81,51,82],[51,83,51,84],[51,85,51,86],[51,87,51,88],[51,89,51,90],[53,91,53,92],[53,93,53,95],[53,96,53,98],[51,99,51,101],[51,102,51,103],[51,104,51,105],[51,91,51,92],[51,93,51,95],[51,96,51,98],[53,99,53,101],[53,102,53,103],[53,104,53,105],[53,106,53,107],[53,108,53,109],[53,110,53,111],[54,79,54,80],[54,81,54,82],[54,83,54,84],[54,85,54,86],[54,87,54,88],[54,89,54,90],[54,91,54,92],[54,93,54,95],[54,96,54,98],[54,99,54,101],[54,102,54,103],[54,104,54,105],[54,106,54,107],[54,108,54,109],[54,110,54,111],[53,79,53,80],[53,81,53,82],[53,83,53,84],[53,85,53,86],[53,87,53,88],[53,89,53,90],[42,5,42,6],[42,9,42,10],[40,3,40,4],[40,1,40,2],[39,11,39,12],[40,11,40,12],[39,5,39,6],[40,5,40,6],[41,21,41,23],[40,18,40,20],[41,18,41,20],[42,18,42,20],[40,7,40,8],[40,15,40,17],[42,15,42,17],[39,1,39,2],[39,15,39,17],[41,1,41,2],[40,9,40,10],[41,9,41,10],[41,7,41,8],[39,7,39,8],[55,5,55,6],[58,5,58,6],[35,1,35,2],[36,1,36,2],[41,3,41,4],[42,3,42,4],[42,1,42,2],[38,28,38,29],[42,24,42,25],[38,5,38,6],[55,18,55,20],[58,18,58,20],[56,26,56,27],[55,26,55,27],[58,26,58,27],[53,28,53,29],[56,28,56,29],[56,3,56,4],[53,1,53,2],[54,1,54,2],[57,3,57,4],[53,21,53,23],[54,21,54,23],[54,28,54,29],[90,24,92,33],[89,1,89,33],[104,4,104,23],[43,32,43,33],[35,21,35,23],[40,24,40,25],[40,21,40,23],[35,3,35,4],[36,3,36,4],[37,7,37,8],[38,7,38,8],[43,24,43,25],[43,30,43,31],[43,21,43,23],[94,1,98,33],[55,7,55,8],[58,7,58,8],[59,7,59,8],[55,1,55,2],[58,1,58,2],[59,1,59,2],[55,3,55,4],[58,3,58,4],[59,3,59,4]]}
[null,"Producer:",null,null,null,null,null,null,null,null,null,null,null,null,null,"Program:",null,null,null,null,null,null,"Contract #:"]
[null,"County","Farm",null,null,"Tract(s)",null,null,null,null,null,null,null,null,"Field(s)",null,null,null,null,null,null,null,"Acres",null,"CIN",null,"Years planned & crop sequence notes"]
[]
[]
[]
[null,null,null,null,null,null,null,null,null,null,null,null,null,null,null,null,null,null,null,null,null,null,null,null,null,null,null,null,null,null,null,null,null,null,null,null,null,null,null,null,null,null,null,null,null,null,null,null,null,null,null,null,null,null,null,null,null,null,null,null,null,null,null,null,null,null,null,null,null,null,"EQIP",null,null,null,"ADAIR","Southwest"]
[null,null,null,null,null,null,null,null,null,null,null,null,null,null,null,null,null,null,null,null,null,null,null,null,null,null,null,null,null,null,null,null,null,null,null,null,null,null,null,null,null,null,null,null,null,null,null,null,null,null,null,null,null,null,null,null,null,null,null,null,null,null,null,null,null,null,null,null,null,null,"CSP",null,null,null,"ADAMS","Southwest"]
[null,"Planting Zone:",{"$f":"IF(B3=\"\",\"\",VLOOKUP(B3,Lists!Q2:R101,2,FALSE))","v":""},null,null,null,null,null,null,null,null,null,null,null,null,null,null,"Total Acres:",null,null,null,{"$f":"W3+W4+W5+W6+W7","v":0},null,null,null,null,null,null,null,null,null,null,null,null,null,null,null,null,null,null,null,null,null,null,null,null,null,null,null,null,null,null,null,null,null,null,null,null,null,"Acres",{"$f":"SUM(W3:X7)","v":0},null,null,null,null,null,null,null,null,null,"State Cost Share",null,null,null,"ALLAMAKEE","Northeast"]
[null,"Crop Rotation:",null,null,null,null,null,null,null,null,null,null,null,null,null,null,null,"See Plan Map for field and location information.",null,null,null,null,null,null,null,null,null,null,null,null,null,null,null,null,null,null,null,null,null,null,null,null,null,null,null,null,null,null,null,null,null,null,null,null,null,null,null,null,null,null,null,null,null,null,null,null,null,null,null,null,"WQI",null,null,null,"APPANOOSE","South_Central"]
[null,null,null,null,null,null,null,null,null,null,null,null,null,null,null,null,null,null,null,null,null,null,null,null,null,null,null,null,null,null,null,null,null,null,null,null,null,null,null,null,null,null,null,null,null,null,null,null,null,null,null,null,null,null,null,null,null,null,null,null,null,null,null,null,null,null,null,null,null,null,"RCPP",null,null,null,"AUDUBON","West_Central"]
[null,"Goals and Objectives:",null,null,null,null,null,null,null,null,null,null,null,null,null,null,null,"Utility Safety/ One-Call System Information:",null,null,null,null,null,null,null,null,null,null,null,null,null,null,null,null,null,null,null,null,null,null,null,null,null,null,null,null,null,null,null,null,null,null,null,null,null,null,null,null,null,null,null,null,null,null,null,null,null,null,null,null,"Watershed",null,null,null,"BENTON","East_Central"]
[null,null,null,null,null,null,null,null,null,null,null,null,null,null,null,null,null,"IowaOneCall.com or Call 811\n\nNot Applicable for Cover Crops.",null,null,null,null,null,null,null,null,null,null,null,null,null,null,null,null,null,null,null,null,null,null,null,null,null,null,null,null,null,null,null,null,null,null,null,null,null,null,null,null,null,null,null,null,null,null,null,null,null,null,null,null,"Other",null,null,null,"BLACK HAWK","Northeast"]
[null,"Description of work:",null,null,null,null,null,null,null,null,null,null,null,null,null,null,null,null,null,null,null,null,null,null,null,null,null,null,null,null,null,null,null,null,null,null,null,null,null,null,null,null,null,null,null,null,null,null,null,null,null,null,null,null,null,null,null,null,null,null,null,null,null,null,null,null,null,null,null,null,null,null,null,null,"BOONE","Central"]
[null,null,null,null,null,null,null,null,null,null,null,null,null,null,null,null,null,null,null,null,null,null,null,null,null,null,null,null,null,null,null,null,null,null,null,null,null,null,null,null,null,null,null,null,null,null,null,null,null,null,null,null,null,null,null,null,null,null,null,null,null,null,null,null,null,null,null,null,null,null,null,null,null,null,"BREMER","Northeast"]
[null,"Practice Purpose:",null,null,null,null,null,null,null,null,null,null,null,null,null,null,null,null,null,null,null,null,null,null,null,null,null,null,null,null,null,null,null,null,null,null,null,null,null,null,null,null,null,null,null,null,null,null,null,null,null,null,null,null,null,null,null,null,null,null,null,null,null,null,null,null,null,null,null,null,null,null,null,null,"BUCHANAN","Northeast"]
[null,null,null,null,"Reduce erosion from wind and water.",null,null,null,null,null,null,null,null,null,null,null,null,null,null,"Suppress excessive weed pressures and break pest cycles.",null,null,null,null,null,null,null,null,null,null,null,null,null,null,null,null,null,null,null,null,null,null,null,null,null,null,null,null,null,null,null,null,null,null,null,null,null,null,null,null,null,null,null,null,null,null,null,null,null,null,null,null,null,null,"BUENA VISTA","Northwest"]
[null,null,null,null,"Maintain or increase soil health and organic matter content.",null,null,null,null,null,null,null,null,null,null,null,null,null,null,"Improve soil moisture use efficiency.",null,null,null,null,null,null,null,null,null,null,null,null,null,null,null,null,null,null,null,null,null,null,null,null,null,null,null,null,null,null,null,null,null,null,null,{"$f":"IF(BD22=20,20,\"hide\")","v":20},null,null,null,null,null,null,null,null,null,null,null,null,null,null,null,null,null,null,"BUTLER","North_Central"]
[null,null,null,null,"Reduce water quality degradation by utilizing excessive soil nutrients.",null,null,null,null,null,null,null,null,null,null,null,null,null,null,"Minimize soil compaction.",null,null,null,null,null,null,null,null,null,null,null,null,null,null,null,null,null,null,null,null,null,null,null,null,null,null,null,null,null,null,null,null,null,null,null,{"$f":"IF(BD21=2,2,\"hide\")","v":"hide"},null,null,null,null,null,null,null,null,null,null,null,null,null,null,null,null,null,null,"CALHOUN","West_Central"]
[null,null,null,null,null,null,null,null,null,null,null,null,null,null,null,null,null,null,null,null,null,null,null,null,null,null,null,null,null,null,null,null,null,null,null,null,null,null,null,null,null,null,null,null,null,null,null,null,null,null,null,null,null,null,null,null,null,null,null,null,null,null,null,null,null,null,null,null,null,null,null,null,null,null,"CARROLL","West_Central"]
[null,null,null,null,null,null,null,null,null,null,null,null,null,null,null,null,null,null,null,null,null,null,null,null,null,null,null,null,null,null,null,null,null,null,null,null,null,null,null,null,null,null,null,null,null,null,null,null,null,null,null,null,null,null,null,null,null,null,null,null,null,null,null,null,null,null,null,null,null,null,null,null,null,null,"CASS","Southwest"]
[null,"Seeding Timeframe:",null,"Fall Seeding",null,null,null,null,null,null,null,"Spring Seeding",null,null,null,null,null,null,null,"Interseed V4-V6 Corn",null,null,null,null,null,null,null,"Summer Seeding",null,null,null,null,null,null,null,null,null,null,null,null,null,null,null,null,null,null,null,null,null,null,null,null,null,null,null,1,{"$f":"IF($BD$21=1, \"Fall\", IF($BD$21=2,\"Spring\", IF($BD$21=3,\"Interseed\", IF($BD$21=4,\"Summer\", \"--\"))))","v":"Fall"},null,null,{"$f":"IF($BD$21=1, Lists!$X$2:$X$24, IF($BD$21=2,Lists!$Y$2:$Y$18, IF($BD$21=3, Lists!$Z$2:$Z$33, IF($BD$21=4,Lists!$AA$2:$AA$22, \"--\"))))","v":"Barley, Spring"},null,null,{"$f":"IF($C$8=\"Northwest\", Lists!$AP$2:$AP$13, IF($C$8=\"North_Central\",Lists!$AS$2:$AS12, IF($C$8=\"Northeast\", Lists!$AV$2:$AV$12, IF($C$8=\"West_Central\",Lists!$AY$2:$AY$13, IF($C$8=\"Central\",Lists!$BB$2:$BB13, IF($C$8=\"East_Central\", Lists!$BE$2:$BE$12, IF($C$8=\"Southwest\",Lists!$BH$2:$BH$10,  IF($C$8=\"South_Central\",Lists!$BK$2:$BK12, IF($C$8=\"Southeast\", Lists!$BN$2:$BN$12, \"--\")))))))))","v":"--"},null,null,null,null,null,null,null,null,null,null,null,"CEDAR","East_Central"]
[null,"Seeding Method:",null,"Drill/Planter/Broadcast w/with Incorporation",null,null,null,null,null,null,null,null,null,null,null,null,null,null,null,"Aerial/Broadcast-not Incorporated",null,null,null,null,null,null,null,null,null,null,null,null,null,null,null,null,null,null,null,null,null,null,null,null,null,null,null,null,null,null,null,null,null,null,null,20,{"$f":"IF($BD$22=10,\"Incorporated\",\"Aerial\")","v":"Aerial"},null,null,"Barley, Winter",null,null,null,null,null,null,null,null,null,null,null,null,null,null,"CERRO GORDO","North_Central"]
[null,null,null,null,null,null,null,null,null,null,null,null,null,null,null,null,null,null,null,null,null,null,null,null,null,null,null,null,null,null,null,null,null,null,null,null,null,null,null,null,null,null,null,null,null,null,null,null,null,null,null,null,null,null,null,null,null,null,null,"Buckwheat",null,null,null,null,null,null,null,null,null,null,null,null,null,null,"CHEROKEE","Northwest"]
[null,"Planned Termination Method:",null,null,null,null,null,null,null,null,null,null,null,null,null,"Termination Timing:",null,null,null,null,null,null,null,null,null,null,null,null,null,null,null,null,null,null,null,null,null,null,null,null,null,null,null,null,null,null,null,null,null,null,null,null,null,null,null,null,null,null,null,"Camelina, Winter",null,null,null,null,"Killing Freeze",null,"Winterkill",null,null,null,null,null,null,null,"CHICKASAW","Northeast"]
[null,null,null,null,null,null,null,null,null,null,null,null,null,null,null,null,null,null,null,null,null,null,null,null,null,null,null,null,null,null,null,null,null,null,null,null,null,null,null,null,null,null,null,null,null,null,null,null,null,null,null,null,null,null,null,null,null,null,null,"Clover, Berseem",null,null,null,null,"Herbicide",null,"2 weeks before planting following crop",null,null,null,null,null,null,null,"CLARKE","South_Central"]
[null,"Management Considerations: ",null,null,null,null,null,null,null,null,null,null,null,null,null,null,null,null,null,null,null,null,null,null,null,null,null,null,null,null,null,null,null,null,null,null,null,null,null,null,null,null,null,null,null,null,null,null,null,null,null,null,null,null,null,null,null,null,null,"Clover, Crimson",null,null,null,null,"Crimp",null,"At the time of planting following crop",null,null,null,null,null,null,null,"CLAY","Northwest"]
[null,"Plant growth stage and environmental conditions such as soil moisture and/or snow cover all impact tolerance to low temps.  Plant species with a low temperature tolerance of -15o F or lower will typically overwinter in Iowa when properly hardened off and/or established.",null,null,null,null,null,null,null,null,null,null,null,null,null,null,null,null,null,null,null,null,null,null,null,null,null,null,null,null,null,null,null,null,null,null,null,null,null,null,null,null,null,null,null,null,null,null,null,null,null,null,null,null,null,null,null,null,null,"Clover, Red",null,null,null,null,"Tillage",null,"After planting crop but prior to emergence",null,null,null,null,null,null,null,"CLAYTON","Northeast"]
[null,{"$f":"IF(BE22=\"Aerial\",Statements!B5,\"\")","v":"Successful establishment of cover crops with an aerial or broadcast not incorporated seeding depends on having adequate moisture for germination and establishment. A moist seedbed at time of application or a forecast of rain within ~10 days of seeding is recommended."},null,null,null,null,null,null,null,null,null,null,null,null,null,null,null,null,null,null,null,null,null,null,null,null,null,null,null,null,null,null,null,null,null,null,null,null,null,null,null,null,null,null,null,null,null,null,null,null,null,null,null,null,null,null,null,null,null,"Clover, White",null,null,null,null,"Canopy/none",null,"At Anthesis (flowering/shedding pollen)",null,null,null,null,null,null,null,"CLINTON","East_Central"]
[null,null,null,null,null,null,null,null,null,null,null,null,null,null,null,null,null,null,null,null,null,null,null,null,null,null,null,null,null,null,null,null,null,null,null,null,null,null,null,null,null,null,null,null,null,null,null,null,null,null,null,null,null,null,null,null,null,null,null,"Flax",null,null,null,null,null,null,"Other - use cell below to describe",null,null,null,null,null,null,null,"CRAWFORD","West_Central"]
[null,null,null,null,null,null,null,null,null,null,null,null,null,null,null,null,null,null,null,null,null,null,null,null,null,null,null,null,null,null,null,null,null,null,null,null,null,null,null,null,null,null,null,null,null,null,null,null,null,null,null,null,null,null,null,null,null,null,null,"Kale",null,null,null,null,null,null,null,null,null,null,null,null,null,null,"DALLAS","Central"]
[null,null,null,null,null,null,null,null,null,null,null,null,null,null,null,null,null,null,null,null,null,null,null,null,null,null,null,null,null,null,null,null,null,null,null,null,null,null,null,null,null,null,null,null,null,null,null,null,null,null,null,null,null,null,null,null,null,null,null,"Mustard",null,null,null,null,null,null,null,null,null,null,null,null,null,null,"DAVIS","Southeast"]
[null,"Planned Cover Crop Mixture:",null,null,null,null,null,null,null,null,null,null,null,null,null,null,null,null,null,null,null,null,null,null,null,null,null,null,null,null,null,null,null,null,null,null,null,null,null,null,null,null,null,null,null,null,null,null,null,null,null,null,null,null,null,null,null,null,null,"Oats",null,null,null,null,null,null,null,null,null,null,null,null,null,null,"DECATUR","South_Central"]
[null,"Use bulk rate for seed with a minimum of 80% PLS. Use rate based on PLS lbs. for all other seed. Automatically calculated below.\nAll seed must be tested for germination and purity by a Certified Seed Lab.  Test will be no older than 12 months.",null,null,null,null,null,null,null,null,null,null,null,null,null,null,null,null,null,null,null,null,null,null,null,null,{"$f":"IF($BD$21=1, \"Fall\", IF($BD$21=2,\"Spring/Summer\", IF($BD$21=3,\"Spring/Summer\", IF($BD$21=4,\"Spring/Summer\", \"--\"))))","v":"Fall"},null,null,null,null,null,null,null,null,null,null,null,null,null,null,null,null,null,null,null,null,null,null,null,null,null,null,null,null,null,1,"Fall",null,"Pea, Field/Winter",null,null,null,null,null,null,null,null,null,null,null,null,null,null,"DELAWARE","Northeast"]
[null,"--",null,"Full Seed Rate #/ac",null,"Acres",null,"Germ %",null,"Purity %",null,"% of Full Rate/Mix",null,"Rate lb./ac",null,"Total lbs.",null,null,"Recommended Planting Depth (in)  ",null,null,"Approx. Low Temp. Tolerance",null,null,"Crop Type",null,"Start",null,"Start Prime",null,"End Prime",null,"End ",null,null,null,null,null,null,null,null,null,null,null,null,null,null,null,null,null,null,null,null,null,null,null,2,"Spring",null,"Radish",null,null,null,null,null,null,null,null,null,null,null,null,null,null,"DES MOINES","Southeast"]
[null,"Cover Crop Species",null,null,null,null,null,null,null,null,null,null,null,null,null,null,null,null,null,null,null,null,null,null,null,null,null,null,null,null,null,null,null,null,null,null,null,null,null,null,null,null,null,null,null,null,null,null,null,null,null,null,null,null,null,null,3,"Interseed",null,"Rapeseed",null,null,null,null,null,null,null,null,null,null,null,null,null,null,"DICKINSON","Northwest"]
[null,null,null,{"$f":"IF(B36=\"\",\"\",IF($BD$22=10,VLOOKUP(B36,Lists!$AF$2:$AJ$35,3,FALSE),IF('Seeding Plan'!$BD$22=20,VLOOKUP(B36,Lists!$AF$2:$AJ$35,4,FALSE))))","v":""},null,{"$f":"IF(B36=\"\",\"\",+$V$8)","v":""},null,0.85,null,0.95,null,null,null,{"$f":"IF(B36=\"\",\"\",IF((H36*J36>0.79999999),L36*D36,(L36*D36)/(H36*J36)))","v":""},null,{"$f":"+IF(B36=\"\",\"\",N36*F36)","v":""},null,null,{"$f":"IF(B36=\"\",\"\",VLOOKUP(B36,Lists!$AF$2:$AK$35,2,FALSE))","v":""},null,null,{"$f":"IF(B36=\"\",\"\",VLOOKUP(B36,Lists!$AF$2:$AL$35,7,FALSE))","v":""},null,null,{"$f":"IF(B36=\"\",\"\",VLOOKUP(B36,Lists!$AF$2:$AK$35,6,FALSE))","v":""},null,{"$f":"IF($AA$33=\"Fall\",Lists!P107,Lists!L107)","v":""},null,{"$f":"IF($AA$33=\"Fall\",Lists!Q107,Lists!M107)","v":""},null,{"$f":"IF($AA$33=\"Fall\",Lists!R107,Lists!N107)","v":""},null,{"$f":"IF($AA$33=\"Fall\",Lists!S107,Lists!O107)","v":""},null,null,null,null,null,null,null,null,null,null,null,null,null,null,null,null,null,null,null,null,null,null,null,4,"Summer",null,"Rye, Winter/Cereal",null,null,null,null,null,null,null,null,null,null,null,null,null,null,"DUBUQUE","Northeast",null,null,null,null,null,{"$f":"IF(CB36=\"\",\"\",IF($BD$22=10,VLOOKUP(CB36,Lists!$AF$2:$AJ$35,3,FALSE),IF('Seeding Plan'!$BD$22=20,VLOOKUP(CB36,Lists!$AF$2:$AJ$35,4,FALSE))))","v":""},null,{"$f":"IF(CB36=\"\",\"\",+$AF$6)","v":""},null,null,null,null,null,null,null,{"$f":"IF(CB36=\"\",\"\",IF(AND(CH36>0.845, CJ36>0.945),CL36*CD36,(CL36*CD36)/(CH36*CJ36)))","v":""},null,{"$f":"+IF(CB36=\"\",\"\",CN36*CF36)","v":""},null,null,{"$f":"IF(CB36=\"\",\"\",VLOOKUP(CB36,Lists!$AF$2:$AK$35,2,FALSE))","v":""},null,null,{"$f":"IF(CB36=\"\",\"\",VLOOKUP(CB36,Lists!$AF$2:$AL$35,7,FALSE))","v":""},null,null,{"$f":"IF(CB36=\"\",\"\",VLOOKUP(CB36,Lists!$AF$2:$AK$35,6,FALSE))","v":""},null,{"$f":"IF($AA$33=\"Fall\",Lists!CP107,Lists!CL107)","v":"00:00:00"},null,{"$f":"IF($AA$33=\"Fall\",Lists!CQ107,Lists!CM107)","v":"00:00:00"},null,{"$f":"IF($AA$33=\"Fall\",Lists!CR107,Lists!CN107)","v":"00:00:00"},null,{"$f":"IF($AA$33=\"Fall\",Lists!CS107,Lists!CO107)","v":"00:00:00"}]
[null,null,null,{"$f":"IF(B37=\"\",\"\",IF($BD$22=10,VLOOKUP(B37,Lists!$AF$2:$AJ$35,3,FALSE),IF('Seeding Plan'!$BD$22=20,VLOOKUP(B37,Lists!$AF$2:$AJ$35,4,FALSE))))","v":""},null,{"$f":"IF(B37=\"\",\"\",+$V$8)","v":""},null,0.85,null,0.95,null,null,null,{"$f":"IF(B37=\"\",\"\",IF((H37*J37>0.79999999),L37*D37,(L37*D37)/(H37*J37)))","v":""},null,"",null,null,{"$f":"IF(B37=\"\",\"\",VLOOKUP(B37,Lists!$AF$2:$AK$35,2,FALSE))","v":""},null,null,{"$f":"IF(B37=\"\",\"\",VLOOKUP(B37,Lists!$AF$2:$AL$35,7,FALSE))","v":""},null,null,{"$f":"IF(B37=\"\",\"\",VLOOKUP(B37,Lists!$AF$2:$AK$35,6,FALSE))","v":""},null,{"$f":"IF($AA$33=\"Fall\",Lists!P108,Lists!L108)","v":""},null,{"$f":"IF($AA$33=\"Fall\",Lists!Q108,Lists!M108)","v":""},null,{"$f":"IF($AA$33=\"Fall\",Lists!R108,Lists!N108)","v":""},null,{"$f":"IF($AA$33=\"Fall\",Lists!S108,Lists!O108)","v":""},null,null,null,null,null,null,null,null,null,null,null,null,null,null,null,null,null,null,null,null,null,null,null,10,"Incorporated",null,"Ryegrass, Annual",null,null,null,null,null,null,null,null,null,null,null,null,null,null,"EMMET","Northwest",null,null,null,null,null,{"$f":"IF(CB37=\"\",\"\",IF($BD$22=10,VLOOKUP(CB37,Lists!$AF$2:$AJ$35,3,FALSE),IF('Seeding Plan'!$BD$22=20,VLOOKUP(CB37,Lists!$AF$2:$AJ$35,4,FALSE))))","v":""},null,"",null,null,null,null,null,null,null,{"$f":"IF(CB37=\"\",\"\",IF(AND(CH37>0.845, CJ37>0.945),CL37*CD37,(CL37*CD37)/(CH37*CJ37)))","v":""},null,"",null,null,{"$f":"IF(CB37=\"\",\"\",VLOOKUP(CB37,Lists!$AF$2:$AK$35,2,FALSE))","v":""},null,null,{"$f":"IF(CB37=\"\",\"\",VLOOKUP(CB37,Lists!$AF$2:$AL$35,7,FALSE))","v":""},null,null,{"$f":"IF(CB37=\"\",\"\",VLOOKUP(CB37,Lists!$AF$2:$AK$35,6,FALSE))","v":""},null,{"$f":"IF($AA$33=\"Fall\",Lists!CP108,Lists!CL108)","v":"00:00:00"},null,{"$f":"IF($AA$33=\"Fall\",Lists!CQ108,Lists!CM108)","v":"00:00:00"},null,{"$f":"IF($AA$33=\"Fall\",Lists!CR108,Lists!CN108)","v":"00:00:00"},null,{"$f":"IF($AA$33=\"Fall\",Lists!CS108,Lists!CO108)","v":"00:00:00"}]
[null,null,null,{"$f":"IF(B38=\"\",\"\",IF($BD$22=10,VLOOKUP(B38,Lists!$AF$2:$AJ$35,3,FALSE),IF('Seeding Plan'!$BD$22=20,VLOOKUP(B38,Lists!$AF$2:$AJ$35,4,FALSE))))","v":""},null,"",null,0.85,null,0.95,null,null,null,"",null,"",null,null,{"$f":"IF(B38=\"\",\"\",VLOOKUP(B38,Lists!$AF$2:$AK$35,2,FALSE))","v":""},null,null,{"$f":"IF(B38=\"\",\"\",VLOOKUP(B38,Lists!$AF$2:$AL$35,7,FALSE))","v":""},null,null,{"$f":"IF(B38=\"\",\"\",VLOOKUP(B38,Lists!$AF$2:$AK$35,6,FALSE))","v":""},null,{"$f":"IF($AA$33=\"Fall\",Lists!P109,Lists!L109)","v":""},null,{"$f":"IF($AA$33=\"Fall\",Lists!Q109,Lists!M109)","v":""},null,{"$f":"IF($AA$33=\"Fall\",Lists!R109,Lists!N109)","v":""},null,{"$f":"IF($AA$33=\"Fall\",Lists!S109,Lists!O109)","v":""},null,null,null,null,null,null,null,null,null,null,null,null,null,null,null,null,null,null,null,null,null,null,null,20,"Aerial",null,"Triticale, Winter",null,null,null,null,null,null,null,null,null,null,null,null,null,null,"FAYETTE","Northeast",null,null,null,null,null,{"$f":"IF(CB38=\"\",\"\",IF($BD$22=10,VLOOKUP(CB38,Lists!$AF$2:$AJ$35,3,FALSE),IF('Seeding Plan'!$BD$22=20,VLOOKUP(CB38,Lists!$AF$2:$AJ$35,4,FALSE))))","v":""},null,"",null,null,null,null,null,null,null,"",null,"",null,null,{"$f":"IF(CB38=\"\",\"\",VLOOKUP(CB38,Lists!$AF$2:$AK$35,2,FALSE))","v":""},null,null,{"$f":"IF(CB38=\"\",\"\",VLOOKUP(CB38,Lists!$AF$2:$AL$35,7,FALSE))","v":""},null,null,{"$f":"IF(CB38=\"\",\"\",VLOOKUP(CB38,Lists!$AF$2:$AK$35,6,FALSE))","v":""},null,{"$f":"IF($AA$33=\"Fall\",Lists!CP109,Lists!CL109)","v":"00:00:00"},null,{"$f":"IF($AA$33=\"Fall\",Lists!CQ109,Lists!CM109)","v":"00:00:00"},null,{"$f":"IF($AA$33=\"Fall\",Lists!CR109,Lists!CN109)","v":"00:00:00"},null,{"$f":"IF($AA$33=\"Fall\",Lists!CS109,Lists!CO109)","v":"00:00:00"}]
[null,null,null,{"$f":"IF(B39=\"\",\"\",IF($BD$22=10,VLOOKUP(B39,Lists!$AF$2:$AJ$35,3,FALSE),IF('Seeding Plan'!$BD$22=20,VLOOKUP(B39,Lists!$AF$2:$AJ$35,4,FALSE))))","v":""},null,"",null,0.85,null,0.95,null,null,null,"",null,"",null,null,{"$f":"IF(B39=\"\",\"\",VLOOKUP(B39,Lists!$AF$2:$AK$35,2,FALSE))","v":""},null,null,{"$f":"IF(B39=\"\",\"\",VLOOKUP(B39,Lists!$AF$2:$AL$35,7,FALSE))","v":""},null,null,{"$f":"IF(B39=\"\",\"\",VLOOKUP(B39,Lists!$AF$2:$AK$35,6,FALSE))","v":""},null,{"$f":"IF($AA$33=\"Fall\",Lists!P110,Lists!L110)","v":""},null,{"$f":"IF($AA$33=\"Fall\",Lists!Q110,Lists!M110)","v":""},null,{"$f":"IF($AA$33=\"Fall\",Lists!R110,Lists!N110)","v":""},null,{"$f":"IF($AA$33=\"Fall\",Lists!S110,Lists!O110)","v":""},null,null,null,null,null,null,null,null,null,null,null,null,null,null,null,null,null,null,null,null,null,null,null,null,null,null,"Turnip",null,null,null,null,null,null,null,null,null,null,null,null,null,null,"FLOYD","North_Central",null,null,null,null,null,{"$f":"IF(CB39=\"\",\"\",IF($BD$22=10,VLOOKUP(CB39,Lists!$AF$2:$AJ$35,3,FALSE),IF('Seeding Plan'!$BD$22=20,VLOOKUP(CB39,Lists!$AF$2:$AJ$35,4,FALSE))))","v":""},null,"",null,null,null,null,null,null,null,"",null,"",null,null,{"$f":"IF(CB39=\"\",\"\",VLOOKUP(CB39,Lists!$AF$2:$AK$35,2,FALSE))","v":""},null,null,{"$f":"IF(CB39=\"\",\"\",VLOOKUP(CB39,Lists!$AF$2:$AL$35,7,FALSE))","v":""},null,null,{"$f":"IF(CB39=\"\",\"\",VLOOKUP(CB39,Lists!$AF$2:$AK$35,6,FALSE))","v":""},null,{"$f":"IF($AA$33=\"Fall\",Lists!CP110,Lists!CL110)","v":"00:00:00"},null,{"$f":"IF($AA$33=\"Fall\",Lists!CQ110,Lists!CM110)","v":"00:00:00"},null,{"$f":"IF($AA$33=\"Fall\",Lists!CR110,Lists!CN110)","v":"00:00:00"},null,{"$f":"IF($AA$33=\"Fall\",Lists!CS110,Lists!CO110)","v":"00:00:00"}]
[null,null,null,{"$f":"IF(B40=\"\",\"\",IF($BD$22=10,VLOOKUP(B40,Lists!$AF$2:$AJ$35,3,FALSE),IF('Seeding Plan'!$BD$22=20,VLOOKUP(B40,Lists!$AF$2:$AJ$35,4,FALSE))))","v":""},null,"",null,0.85,null,0.95,null,null,null,"",null,"",null,null,{"$f":"IF(B40=\"\",\"\",VLOOKUP(B40,Lists!$AF$2:$AK$35,2,FALSE))","v":""},null,null,{"$f":"IF(B40=\"\",\"\",VLOOKUP(B40,Lists!$AF$2:$AL$35,7,FALSE))","v":""},null,null,{"$f":"IF(B40=\"\",\"\",VLOOKUP(B40,Lists!$AF$2:$AK$35,6,FALSE))","v":""},null,{"$f":"IF($AA$33=\"Fall\",Lists!P111,Lists!L111)","v":""},null,{"$f":"IF($AA$33=\"Fall\",Lists!Q111,Lists!M111)","v":""},null,{"$f":"IF($AA$33=\"Fall\",Lists!R111,Lists!N111)","v":""},null,{"$f":"IF($AA$33=\"Fall\",Lists!S111,Lists!O111)","v":""},null,null,null,null,null,null,null,null,null,null,null,null,null,null,null,null,null,null,null,null,null,null,null,null,null,null,"Vetch, Common",null,null,null,null,null,null,null,null,null,null,null,null,null,null,"FRANKLIN","North_Central",null,null,null,null,null,{"$f":"IF(CB40=\"\",\"\",IF($BD$22=10,VLOOKUP(CB40,Lists!$AF$2:$AJ$35,3,FALSE),IF('Seeding Plan'!$BD$22=20,VLOOKUP(CB40,Lists!$AF$2:$AJ$35,4,FALSE))))","v":""},null,"",null,null,null,null,null,null,null,"",null,"",null,null,{"$f":"IF(CB40=\"\",\"\",VLOOKUP(CB40,Lists!$AF$2:$AK$35,2,FALSE))","v":""},null,null,{"$f":"IF(CB40=\"\",\"\",VLOOKUP(CB40,Lists!$AF$2:$AL$35,7,FALSE))","v":""},null,null,{"$f":"IF(CB40=\"\",\"\",VLOOKUP(CB40,Lists!$AF$2:$AK$35,6,FALSE))","v":""},null,{"$f":"IF($AA$33=\"Fall\",Lists!CP111,Lists!CL111)","v":"00:00:00"},null,{"$f":"IF($AA$33=\"Fall\",Lists!CQ111,Lists!CM111)","v":"00:00:00"},null,{"$f":"IF($AA$33=\"Fall\",Lists!CR111,Lists!CN111)","v":"00:00:00"},null,{"$f":"IF($AA$33=\"Fall\",Lists!CS111,Lists!CO111)","v":"00:00:00"}]
[null,null,null,{"$f":"IF(B41=\"\",\"\",IF($BD$22=10,VLOOKUP(B41,Lists!$AF$2:$AJ$35,3,FALSE),IF('Seeding Plan'!$BD$22=20,VLOOKUP(B41,Lists!$AF$2:$AJ$35,4,FALSE))))","v":""},null,"",null,0.85,null,0.95,null,null,null,"",null,"",null,null,{"$f":"IF(B41=\"\",\"\",VLOOKUP(B41,Lists!$AF$2:$AK$35,2,FALSE))","v":""},null,null,{"$f":"IF(B41=\"\",\"\",VLOOKUP(B41,Lists!$AF$2:$AL$35,7,FALSE))","v":""},null,null,{"$f":"IF(B41=\"\",\"\",VLOOKUP(B41,Lists!$AF$2:$AK$35,6,FALSE))","v":""},null,{"$f":"IF($AA$33=\"Fall\",Lists!P112,Lists!L112)","v":""},null,{"$f":"IF($AA$33=\"Fall\",Lists!Q112,Lists!M112)","v":""},null,{"$f":"IF($AA$33=\"Fall\",Lists!R112,Lists!N112)","v":""},null,{"$f":"IF($AA$33=\"Fall\",Lists!S112,Lists!O112)","v":""},null,null,null,null,null,null,null,null,null,null,null,null,null,null,null,null,null,null,null,null,null,null,null,null,null,null,"Vetch, Hairy",null,null,null,null,null,null,null,null,null,null,null,null,null,null,"FREMONT","Southwest",null,null,null,null,null,{"$f":"IF(CB41=\"\",\"\",IF($BD$22=10,VLOOKUP(CB41,Lists!$AF$2:$AJ$35,3,FALSE),IF('Seeding Plan'!$BD$22=20,VLOOKUP(CB41,Lists!$AF$2:$AJ$35,4,FALSE))))","v":""},null,"",null,null,null,null,null,null,null,"",null,"",null,null,{"$f":"IF(CB41=\"\",\"\",VLOOKUP(CB41,Lists!$AF$2:$AK$35,2,FALSE))","v":""},null,null,{"$f":"IF(CB41=\"\",\"\",VLOOKUP(CB41,Lists!$AF$2:$AL$35,7,FALSE))","v":""},null,null,{"$f":"IF(CB41=\"\",\"\",VLOOKUP(CB41,Lists!$AF$2:$AK$35,6,FALSE))","v":""},null,{"$f":"IF($AA$33=\"Fall\",Lists!CP112,Lists!CL112)","v":"00:00:00"},null,{"$f":"IF($AA$33=\"Fall\",Lists!CQ112,Lists!CM112)","v":"00:00:00"},null,{"$f":"IF($AA$33=\"Fall\",Lists!CR112,Lists!CN112)","v":"00:00:00"},null,{"$f":"IF($AA$33=\"Fall\",Lists!CS112,Lists!CO112)","v":"00:00:00"}]
[null,null,null,{"$f":"IF(B42=\"\",\"\",IF($BD$22=10,VLOOKUP(B42,Lists!$AF$2:$AJ$35,3,FALSE),IF('Seeding Plan'!$BD$22=20,VLOOKUP(B42,Lists!$AF$2:$AJ$35,4,FALSE))))","v":""},null,"",null,0.85,null,0.95,null,null,null,"",null,"",null,null,{"$f":"IF(B42=\"\",\"\",VLOOKUP(B42,Lists!$AF$2:$AK$35,2,FALSE))","v":""},null,null,{"$f":"IF(B42=\"\",\"\",VLOOKUP(B42,Lists!$AF$2:$AL$35,7,FALSE))","v":""},null,null,{"$f":"IF(B42=\"\",\"\",VLOOKUP(B42,Lists!$AF$2:$AK$35,6,FALSE))","v":""},null,{"$f":"IF($AA$33=\"Fall\",Lists!P113,Lists!L113)","v":""},null,{"$f":"IF($AA$33=\"Fall\",Lists!Q113,Lists!M113)","v":""},null,{"$f":"IF($AA$33=\"Fall\",Lists!R113,Lists!N113)","v":""},null,{"$f":"IF($AA$33=\"Fall\",Lists!S113,Lists!O113)","v":""},null,null,null,null,null,null,null,null,null,null,null,null,null,null,null,null,null,null,null,null,null,null,null,null,null,null,"Wheat, Spring",null,null,null,null,null,null,null,null,null,null,null,null,null,null,"GREENE","West_Central",null,null,null,null,null,{"$f":"IF(CB42=\"\",\"\",IF($BD$22=10,VLOOKUP(CB42,Lists!$AF$2:$AJ$35,3,FALSE),IF('Seeding Plan'!$BD$22=20,VLOOKUP(CB42,Lists!$AF$2:$AJ$35,4,FALSE))))","v":""},null,"",null,null,null,null,null,null,null,"",null,"",null,null,{"$f":"IF(CB42=\"\",\"\",VLOOKUP(CB42,Lists!$AF$2:$AK$35,2,FALSE))","v":""},null,null,{"$f":"IF(CB42=\"\",\"\",VLOOKUP(CB42,Lists!$AF$2:$AL$35,7,FALSE))","v":""},null,null,{"$f":"IF(CB42=\"\",\"\",VLOOKUP(CB42,Lists!$AF$2:$AK$35,6,FALSE))","v":""},null,{"$f":"IF($AA$33=\"Fall\",Lists!CP113,Lists!CL113)","v":"00:00:00"},null,{"$f":"IF($AA$33=\"Fall\",Lists!CQ113,Lists!CM113)","v":"00:00:00"},null,{"$f":"IF($AA$33=\"Fall\",Lists!CR113,Lists!CN113)","v":"00:00:00"},null,{"$f":"IF($AA$33=\"Fall\",Lists!CS113,Lists!CO113)","v":"00:00:00"}]
[null,null,null,{"$f":"IF(B43=\"\",\"\",IF($BD$22=10,VLOOKUP(B43,Lists!$AF$2:$AJ$35,3,FALSE),IF('Seeding Plan'!$BD$22=20,VLOOKUP(B43,Lists!$AF$2:$AJ$35,4,FALSE))))","v":""},null,"",null,0.85,null,0.95,null,null,null,"",null,"",null,null,{"$f":"IF(B43=\"\",\"\",VLOOKUP(B43,Lists!$AF$2:$AK$35,2,FALSE))","v":""},null,null,{"$f":"IF(B43=\"\",\"\",VLOOKUP(B43,Lists!$AF$2:$AL$35,7,FALSE))","v":""},null,null,{"$f":"IF(B43=\"\",\"\",VLOOKUP(B43,Lists!$AF$2:$AK$35,6,FALSE))","v":""},null,{"$f":"IF($AA$33=\"Fall\",Lists!P114,Lists!L114)","v":""},null,{"$f":"IF($AA$33=\"Fall\",Lists!Q114,Lists!M114)","v":""},null,{"$f":"IF($AA$33=\"Fall\",Lists!R114,Lists!N114)","v":""},null,{"$f":"IF($AA$33=\"Fall\",Lists!S114,Lists!O114)","v":""},null,null,null,null,null,null,null,null,null,null,null,null,null,null,null,null,null,null,null,null,null,null,null,null,null,null,"Wheat, Winter",null,null,null,null,null,null,null,null,null,null,null,null,null,null,"GRUNDY","Central",null,null,null,null,null,{"$f":"IF(CB43=\"\",\"\",IF($BD$22=10,VLOOKUP(CB43,Lists!$AF$2:$AJ$35,3,FALSE),IF('Seeding Plan'!$BD$22=20,VLOOKUP(CB43,Lists!$AF$2:$AJ$35,4,FALSE))))","v":""},null,"",null,null,null,null,null,null,null,"",null,"",null,null,{"$f":"IF(CB43=\"\",\"\",VLOOKUP(CB43,Lists!$AF$2:$AK$35,2,FALSE))","v":""},null,null,{"$f":"IF(CB43=\"\",\"\",VLOOKUP(CB43,Lists!$AF$2:$AL$35,7,FALSE))","v":""},null,null,{"$f":"IF(CB43=\"\",\"\",VLOOKUP(CB43,Lists!$AF$2:$AK$35,6,FALSE))","v":""},null,{"$f":"IF($AA$33=\"Fall\",Lists!CP114,Lists!CL114)","v":"00:00:00"},null,{"$f":"IF($AA$33=\"Fall\",Lists!CQ114,Lists!CM114)","v":"00:00:00"},null,{"$f":"IF($AA$33=\"Fall\",Lists!CR114,Lists!CN114)","v":"00:00:00"},null,{"$f":"IF($AA$33=\"Fall\",Lists!CS114,Lists!CO114)","v":"00:00:00"}]
[null,null,null,{"$f":"IF(B44=\"\",\"\",IF($BD$22=10,VLOOKUP(B44,Lists!$AF$2:$AJ$35,3,FALSE),IF('Seeding Plan'!$BD$22=20,VLOOKUP(B44,Lists!$AF$2:$AJ$35,4,FALSE))))","v":""},null,"",null,0.85,null,0.95,null,null,null,"",null,"",null,null,{"$f":"IF(B44=\"\",\"\",VLOOKUP(B44,Lists!$AF$2:$AK$35,2,FALSE))","v":""},null,null,{"$f":"IF(B44=\"\",\"\",VLOOKUP(B44,Lists!$AF$2:$AL$35,7,FALSE))","v":""},null,null,{"$f":"IF(B44=\"\",\"\",VLOOKUP(B44,Lists!$AF$2:$AK$35,6,FALSE))","v":""},null,{"$f":"IF($AA$33=\"Fall\",Lists!P115,Lists!L115)","v":""},null,{"$f":"IF($AA$33=\"Fall\",Lists!Q115,Lists!M115)","v":""},null,{"$f":"IF($AA$33=\"Fall\",Lists!R115,Lists!N115)","v":""},null,{"$f":"IF($AA$33=\"Fall\",Lists!S115,Lists!O115)","v":""},null,null,null,null,null,null,null,null,null,null,null,null,null,null,null,null,null,null,null,null,null,null,null,null,null,null,null,null,null,null,null,null,null,null,null,null,null,null,null,null,null,"GUTHRIE","West_Central",null,null,null,null,null,{"$f":"IF(CB44=\"\",\"\",IF($BD$22=10,VLOOKUP(CB44,Lists!$AF$2:$AJ$35,3,FALSE),IF('Seeding Plan'!$BD$22=20,VLOOKUP(CB44,Lists!$AF$2:$AJ$35,4,FALSE))))","v":""},null,"",null,null,null,null,null,null,null,"",null,"",null,null,{"$f":"IF(CB44=\"\",\"\",VLOOKUP(CB44,Lists!$AF$2:$AK$35,2,FALSE))","v":""},null,null,{"$f":"IF(CB44=\"\",\"\",VLOOKUP(CB44,Lists!$AF$2:$AL$35,7,FALSE))","v":""},null,null,{"$f":"IF(CB44=\"\",\"\",VLOOKUP(CB44,Lists!$AF$2:$AK$35,6,FALSE))","v":""},null,{"$f":"IF($AA$33=\"Fall\",Lists!CP115,Lists!CL115)","v":"00:00:00"},null,{"$f":"IF($AA$33=\"Fall\",Lists!CQ115,Lists!CM115)","v":"00:00:00"},null,{"$f":"IF($AA$33=\"Fall\",Lists!CR115,Lists!CN115)","v":"00:00:00"},null,{"$f":"IF($AA$33=\"Fall\",Lists!CS115,Lists!CO115)","v":"00:00:00"}]
[null,null,null,{"$f":"IF(B45=\"\",\"\",IF($BD$22=10,VLOOKUP(B45,Lists!$AF$2:$AJ$35,3,FALSE),IF('Seeding Plan'!$BD$22=20,VLOOKUP(B45,Lists!$AF$2:$AJ$35,4,FALSE))))","v":""},null,"",null,0.85,null,0.95,null,null,null,"",null,"",null,null,{"$f":"IF(B45=\"\",\"\",VLOOKUP(B45,Lists!$AF$2:$AK$35,2,FALSE))","v":""},null,null,{"$f":"IF(B45=\"\",\"\",VLOOKUP(B45,Lists!$AF$2:$AL$35,7,FALSE))","v":""},null,null,{"$f":"IF(B45=\"\",\"\",VLOOKUP(B45,Lists!$AF$2:$AK$35,6,FALSE))","v":""},null,{"$f":"IF($AA$33=\"Fall\",Lists!P116,Lists!L116)","v":""},null,{"$f":"IF($AA$33=\"Fall\",Lists!Q116,Lists!M116)","v":""},null,{"$f":"IF($AA$33=\"Fall\",Lists!R116,Lists!N116)","v":""},null,{"$f":"IF($AA$33=\"Fall\",Lists!S116,Lists!O116)","v":""},null,null,null,null,null,null,null,null,null,null,null,null,null,null,null,null,null,null,null,null,null,null,null,null,null,null,null,null,null,null,null,null,null,null,null,null,null,null,null,null,null,"HAMILTON","Central",null,null,null,null,null,{"$f":"IF(CB45=\"\",\"\",IF($BD$22=10,VLOOKUP(CB45,Lists!$AF$2:$AJ$35,3,FALSE),IF('Seeding Plan'!$BD$22=20,VLOOKUP(CB45,Lists!$AF$2:$AJ$35,4,FALSE))))","v":""},null,"",null,null,null,null,null,null,null,"",null,"",null,null,{"$f":"IF(CB45=\"\",\"\",VLOOKUP(CB45,Lists!$AF$2:$AK$35,2,FALSE))","v":""},null,null,{"$f":"IF(CB45=\"\",\"\",VLOOKUP(CB45,Lists!$AF$2:$AL$35,7,FALSE))","v":""},null,null,{"$f":"IF(CB45=\"\",\"\",VLOOKUP(CB45,Lists!$AF$2:$AK$35,6,FALSE))","v":""},null,{"$f":"IF($AA$33=\"Fall\",Lists!CP116,Lists!CL116)","v":"00:00:00"},null,{"$f":"IF($AA$33=\"Fall\",Lists!CQ116,Lists!CM116)","v":"00:00:00"},null,{"$f":"IF($AA$33=\"Fall\",Lists!CR116,Lists!CN116)","v":"00:00:00"},null,{"$f":"IF($AA$33=\"Fall\",Lists!CS116,Lists!CO116)","v":"00:00:00"}]
[null,null,null,{"$f":"IF(B46=\"\",\"\",IF($BD$22=10,VLOOKUP(B46,Lists!$AF$2:$AJ$35,3,FALSE),IF('Seeding Plan'!$BD$22=20,VLOOKUP(B46,Lists!$AF$2:$AJ$35,4,FALSE))))","v":""},null,"",null,0.85,null,0.95,null,null,null,"",null,"",null,null,{"$f":"IF(B46=\"\",\"\",VLOOKUP(B46,Lists!$AF$2:$AK$35,2,FALSE))","v":""},null,null,{"$f":"IF(B46=\"\",\"\",VLOOKUP(B46,Lists!$AF$2:$AL$35,7,FALSE))","v":""},null,null,{"$f":"IF(B46=\"\",\"\",VLOOKUP(B46,Lists!$AF$2:$AK$35,6,FALSE))","v":""},null,{"$f":"IF($AA$33=\"Fall\",Lists!P117,Lists!L117)","v":""},null,{"$f":"IF($AA$33=\"Fall\",Lists!Q117,Lists!M117)","v":""},null,{"$f":"IF($AA$33=\"Fall\",Lists!R117,Lists!N117)","v":""},null,{"$f":"IF($AA$33=\"Fall\",Lists!S117,Lists!O117)","v":""},null,null,null,null,null,null,null,null,null,null,null,null,null,null,null,null,null,null,null,null,null,null,null,null,null,null,null,null,null,null,null,null,null,null,null,null,null,null,null,null,null,"HANCOCK","North_Central",null,null,null,null,null,{"$f":"IF(CB46=\"\",\"\",IF($BD$22=10,VLOOKUP(CB46,Lists!$AF$2:$AJ$35,3,FALSE),IF('Seeding Plan'!$BD$22=20,VLOOKUP(CB46,Lists!$AF$2:$AJ$35,4,FALSE))))","v":""},null,"",null,null,null,null,null,null,null,"",null,"",null,null,{"$f":"IF(CB46=\"\",\"\",VLOOKUP(CB46,Lists!$AF$2:$AK$35,2,FALSE))","v":""},null,null,{"$f":"IF(CB46=\"\",\"\",VLOOKUP(CB46,Lists!$AF$2:$AL$35,7,FALSE))","v":""},null,null,{"$f":"IF(CB46=\"\",\"\",VLOOKUP(CB46,Lists!$AF$2:$AK$35,6,FALSE))","v":""},null,{"$f":"IF($AA$33=\"Fall\",Lists!CP117,Lists!CL117)","v":"00:00:00"},null,{"$f":"IF($AA$33=\"Fall\",Lists!CQ117,Lists!CM117)","v":"00:00:00"},null,{"$f":"IF($AA$33=\"Fall\",Lists!CR117,Lists!CN117)","v":"00:00:00"},null,{"$f":"IF($AA$33=\"Fall\",Lists!CS117,Lists!CO117)","v":"00:00:00"}]
[null,null,null,{"$f":"IF(B47=\"\",\"\",IF($BD$22=10,VLOOKUP(B47,Lists!$AF$2:$AJ$35,3,FALSE),IF('Seeding Plan'!$BD$22=20,VLOOKUP(B47,Lists!$AF$2:$AJ$35,4,FALSE))))","v":""},null,"",null,0.85,null,0.95,null,null,null,"",null,"",null,null,{"$f":"IF(B47=\"\",\"\",VLOOKUP(B47,Lists!$AF$2:$AK$35,2,FALSE))","v":""},null,null,{"$f":"IF(B47=\"\",\"\",VLOOKUP(B47,Lists!$AF$2:$AL$35,7,FALSE))","v":""},null,null,{"$f":"IF(B47=\"\",\"\",VLOOKUP(B47,Lists!$AF$2:$AK$35,6,FALSE))","v":""},null,{"$f":"IF($AA$33=\"Fall\",Lists!P118,Lists!L118)","v":""},null,{"$f":"IF($AA$33=\"Fall\",Lists!Q118,Lists!M118)","v":""},null,{"$f":"IF($AA$33=\"Fall\",Lists!R118,Lists!N118)","v":""},null,{"$f":"IF($AA$33=\"Fall\",Lists!S118,Lists!O118)","v":""},null,null,null,null,null,null,null,null,null,null,null,null,null,null,null,null,null,null,null,null,null,null,null,null,null,null,null,null,null,null,null,null,null,null,null,null,null,null,null,null,null,"HARDIN","Central",null,null,null,null,null,{"$f":"IF(CB47=\"\",\"\",IF($BD$22=10,VLOOKUP(CB47,Lists!$AF$2:$AJ$35,3,FALSE),IF('Seeding Plan'!$BD$22=20,VLOOKUP(CB47,Lists!$AF$2:$AJ$35,4,FALSE))))","v":""},null,"",null,null,null,null,null,null,null,"",null,"",null,null,{"$f":"IF(CB47=\"\",\"\",VLOOKUP(CB47,Lists!$AF$2:$AK$35,2,FALSE))","v":""},null,null,{"$f":"IF(CB47=\"\",\"\",VLOOKUP(CB47,Lists!$AF$2:$AL$35,7,FALSE))","v":""},null,null,{"$f":"IF(CB47=\"\",\"\",VLOOKUP(CB47,Lists!$AF$2:$AK$35,6,FALSE))","v":""},null,{"$f":"IF($AA$33=\"Fall\",Lists!CP118,Lists!CL118)","v":"00:00:00"},null,{"$f":"IF($AA$33=\"Fall\",Lists!CQ118,Lists!CM118)","v":"00:00:00"},null,{"$f":"IF($AA$33=\"Fall\",Lists!CR118,Lists!CN118)","v":"00:00:00"},null,{"$f":"IF($AA$33=\"Fall\",Lists!CS118,Lists!CO118)","v":"00:00:00"}]
[null,null,null,{"$f":"IF(B48=\"\",\"\",IF($BD$22=10,VLOOKUP(B48,Lists!$AF$2:$AJ$35,3,FALSE),IF('Seeding Plan'!$BD$22=20,VLOOKUP(B48,Lists!$AF$2:$AJ$35,4,FALSE))))","v":""},null,"",null,0.85,null,0.95,null,null,null,"",null,"",null,null,{"$f":"IF(B48=\"\",\"\",VLOOKUP(B48,Lists!$AF$2:$AK$35,2,FALSE))","v":""},null,null,{"$f":"IF(B48=\"\",\"\",VLOOKUP(B48,Lists!$AF$2:$AL$35,7,FALSE))","v":""},null,null,{"$f":"IF(B48=\"\",\"\",VLOOKUP(B48,Lists!$AF$2:$AK$35,6,FALSE))","v":""},null,{"$f":"IF($AA$33=\"Fall\",Lists!P119,Lists!L119)","v":""},null,{"$f":"IF($AA$33=\"Fall\",Lists!Q119,Lists!M119)","v":""},null,{"$f":"IF($AA$33=\"Fall\",Lists!R119,Lists!N119)","v":""},null,{"$f":"IF($AA$33=\"Fall\",Lists!S119,Lists!O119)","v":""},null,null,null,null,null,null,null,null,null,null,null,null,null,null,null,null,null,null,null,null,null,null,null,null,null,null,null,null,null,null,null,null,null,null,null,null,null,null,null,null,null,"HARRISON","West_Central",null,null,null,null,null,{"$f":"IF(CB48=\"\",\"\",IF($BD$22=10,VLOOKUP(CB48,Lists!$AF$2:$AJ$35,3,FALSE),IF('Seeding Plan'!$BD$22=20,VLOOKUP(CB48,Lists!$AF$2:$AJ$35,4,FALSE))))","v":""},null,"",null,null,null,null,null,null,null,"",null,"",null,null,{"$f":"IF(CB48=\"\",\"\",VLOOKUP(CB48,Lists!$AF$2:$AK$35,2,FALSE))","v":""},null,null,{"$f":"IF(CB48=\"\",\"\",VLOOKUP(CB48,Lists!$AF$2:$AL$35,7,FALSE))","v":""},null,null,{"$f":"IF(CB48=\"\",\"\",VLOOKUP(CB48,Lists!$AF$2:$AK$35,6,FALSE))","v":""},null,{"$f":"IF($AA$33=\"Fall\",Lists!CP119,Lists!CL119)","v":"00:00:00"},null,{"$f":"IF($AA$33=\"Fall\",Lists!CQ119,Lists!CM119)","v":"00:00:00"},null,{"$f":"IF($AA$33=\"Fall\",Lists!CR119,Lists!CN119)","v":"00:00:00"},null,{"$f":"IF($AA$33=\"Fall\",Lists!CS119,Lists!CO119)","v":"00:00:00"}]
[null,null,null,{"$f":"IF(B49=\"\",\"\",IF($BD$22=10,VLOOKUP(B49,Lists!$AF$2:$AJ$35,3,FALSE),IF('Seeding Plan'!$BD$22=20,VLOOKUP(B49,Lists!$AF$2:$AJ$35,4,FALSE))))","v":""},null,"",null,0.85,null,0.95,null,null,null,"",null,"",null,null,{"$f":"IF(B49=\"\",\"\",VLOOKUP(B49,Lists!$AF$2:$AK$35,2,FALSE))","v":""},null,null,{"$f":"IF(B49=\"\",\"\",VLOOKUP(B49,Lists!$AF$2:$AL$35,7,FALSE))","v":""},null,null,{"$f":"IF(B49=\"\",\"\",VLOOKUP(B49,Lists!$AF$2:$AK$35,6,FALSE))","v":""},null,{"$f":"IF($AA$33=\"Fall\",Lists!P120,Lists!L120)","v":""},null,{"$f":"IF($AA$33=\"Fall\",Lists!Q120,Lists!M120)","v":""},null,{"$f":"IF($AA$33=\"Fall\",Lists!R120,Lists!N120)","v":""},null,{"$f":"IF($AA$33=\"Fall\",Lists!S120,Lists!O120)","v":""},null,null,null,null,null,null,null,null,null,null,null,null,null,null,null,null,null,null,null,null,null,null,null,null,null,null,null,null,null,null,null,null,null,null,null,null,null,null,null,null,null,"HENRY","Southeast",null,null,null,null,null,{"$f":"IF(CB49=\"\",\"\",IF($BD$22=10,VLOOKUP(CB49,Lists!$AF$2:$AJ$35,3,FALSE),IF('Seeding Plan'!$BD$22=20,VLOOKUP(CB49,Lists!$AF$2:$AJ$35,4,FALSE))))","v":""},null,"",null,null,null,null,null,null,null,"",null,"",null,null,{"$f":"IF(CB49=\"\",\"\",VLOOKUP(CB49,Lists!$AF$2:$AK$35,2,FALSE))","v":""},null,null,{"$f":"IF(CB49=\"\",\"\",VLOOKUP(CB49,Lists!$AF$2:$AL$35,7,FALSE))","v":""},null,null,{"$f":"IF(CB49=\"\",\"\",VLOOKUP(CB49,Lists!$AF$2:$AK$35,6,FALSE))","v":""},null,{"$f":"IF($AA$33=\"Fall\",Lists!CP120,Lists!CL120)","v":"00:00:00"},null,{"$f":"IF($AA$33=\"Fall\",Lists!CQ120,Lists!CM120)","v":"00:00:00"},null,{"$f":"IF($AA$33=\"Fall\",Lists!CR120,Lists!CN120)","v":"00:00:00"},null,{"$f":"IF($AA$33=\"Fall\",Lists!CS120,Lists!CO120)","v":"00:00:00"}]
[null,null,null,{"$f":"IF(B50=\"\",\"\",IF($BD$22=10,VLOOKUP(B50,Lists!$AF$2:$AJ$35,3,FALSE),IF('Seeding Plan'!$BD$22=20,VLOOKUP(B50,Lists!$AF$2:$AJ$35,4,FALSE))))","v":""},null,"",null,0.85,null,0.95,null,null,null,"",null,"",null,null,{"$f":"IF(B50=\"\",\"\",VLOOKUP(B50,Lists!$AF$2:$AK$35,2,FALSE))","v":""},null,null,{"$f":"IF(B50=\"\",\"\",VLOOKUP(B50,Lists!$AF$2:$AL$35,7,FALSE))","v":""},null,null,{"$f":"IF(B50=\"\",\"\",VLOOKUP(B50,Lists!$AF$2:$AK$35,6,FALSE))","v":""},null,{"$f":"IF($AA$33=\"Fall\",Lists!P121,Lists!L121)","v":""},null,{"$f":"IF($AA$33=\"Fall\",Lists!Q121,Lists!M121)","v":""},null,{"$f":"IF($AA$33=\"Fall\",Lists!R121,Lists!N121)","v":""},null,{"$f":"IF($AA$33=\"Fall\",Lists!S121,Lists!O121)","v":""},null,null,null,null,null,null,null,null,null,null,null,null,null,null,null,null,null,null,null,null,null,null,null,null,null,null,null,null,null,null,null,null,null,null,null,null,null,null,null,null,null,"HOWARD","Northeast",null,null,null,null,null,{"$f":"IF(CB50=\"\",\"\",IF($BD$22=10,VLOOKUP(CB50,Lists!$AF$2:$AJ$35,3,FALSE),IF('Seeding Plan'!$BD$22=20,VLOOKUP(CB50,Lists!$AF$2:$AJ$35,4,FALSE))))","v":""},null,"",null,null,null,null,null,null,null,"",null,"",null,null,{"$f":"IF(CB50=\"\",\"\",VLOOKUP(CB50,Lists!$AF$2:$AK$35,2,FALSE))","v":""},null,null,{"$f":"IF(CB50=\"\",\"\",VLOOKUP(CB50,Lists!$AF$2:$AL$35,7,FALSE))","v":""},null,null,{"$f":"IF(CB50=\"\",\"\",VLOOKUP(CB50,Lists!$AF$2:$AK$35,6,FALSE))","v":""},null,{"$f":"IF($AA$33=\"Fall\",Lists!CP121,Lists!CL121)","v":"00:00:00"},null,{"$f":"IF($AA$33=\"Fall\",Lists!CQ121,Lists!CM121)","v":"00:00:00"},null,{"$f":"IF($AA$33=\"Fall\",Lists!CR121,Lists!CN121)","v":"00:00:00"},null,{"$f":"IF($AA$33=\"Fall\",Lists!CS121,Lists!CO121)","v":"00:00:00"}]
[null,null,null,{"$f":"IF(B51=\"\",\"\",IF($BD$22=10,VLOOKUP(B51,Lists!$AF$2:$AJ$35,3,FALSE),IF('Seeding Plan'!$BD$22=20,VLOOKUP(B51,Lists!$AF$2:$AJ$35,4,FALSE))))","v":""},null,"",null,0.85,null,0.95,null,null,null,"",null,"",null,null,{"$f":"IF(B51=\"\",\"\",VLOOKUP(B51,Lists!$AF$2:$AK$35,2,FALSE))","v":""},null,null,{"$f":"IF(B51=\"\",\"\",VLOOKUP(B51,Lists!$AF$2:$AL$35,7,FALSE))","v":""},null,null,{"$f":"IF(B51=\"\",\"\",VLOOKUP(B51,Lists!$AF$2:$AK$35,6,FALSE))","v":""},null,{"$f":"IF($AA$33=\"Fall\",Lists!P122,Lists!L122)","v":""},null,{"$f":"IF($AA$33=\"Fall\",Lists!Q122,Lists!M122)","v":""},null,{"$f":"IF($AA$33=\"Fall\",Lists!R122,Lists!N122)","v":""},null,{"$f":"IF($AA$33=\"Fall\",Lists!S122,Lists!O122)","v":""},null,null,null,null,null,null,null,null,null,null,null,null,null,null,null,null,null,null,null,null,null,null,null,null,null,null,null,null,null,null,null,null,null,null,null,null,null,null,null,null,null,"HUMBOLDT","North_Central",null,null,null,null,null,{"$f":"IF(CB51=\"\",\"\",IF($BD$22=10,VLOOKUP(CB51,Lists!$AF$2:$AJ$35,3,FALSE),IF('Seeding Plan'!$BD$22=20,VLOOKUP(CB51,Lists!$AF$2:$AJ$35,4,FALSE))))","v":""},null,"",null,null,null,null,null,null,null,"",null,"",null,null,{"$f":"IF(CB51=\"\",\"\",VLOOKUP(CB51,Lists!$AF$2:$AK$35,2,FALSE))","v":""},null,null,{"$f":"IF(CB51=\"\",\"\",VLOOKUP(CB51,Lists!$AF$2:$AL$35,7,FALSE))","v":""},null,null,{"$f":"IF(CB51=\"\",\"\",VLOOKUP(CB51,Lists!$AF$2:$AK$35,6,FALSE))","v":""},null,{"$f":"IF($AA$33=\"Fall\",Lists!CP122,Lists!CL122)","v":"00:00:00"},null,{"$f":"IF($AA$33=\"Fall\",Lists!CQ122,Lists!CM122)","v":"00:00:00"},null,{"$f":"IF($AA$33=\"Fall\",Lists!CR122,Lists!CN122)","v":"00:00:00"},null,{"$f":"IF($AA$33=\"Fall\",Lists!CS122,Lists!CO122)","v":"00:00:00"}]
[null,null,null,{"$f":"IF(B52=\"\",\"\",IF($BD$22=10,VLOOKUP(B52,Lists!$AF$2:$AJ$35,3,FALSE),IF('Seeding Plan'!$BD$22=20,VLOOKUP(B52,Lists!$AF$2:$AJ$35,4,FALSE))))","v":""},null,"",null,0.85,null,0.95,null,null,null,"",null,"",null,null,{"$f":"IF(B52=\"\",\"\",VLOOKUP(B52,Lists!$AF$2:$AK$35,2,FALSE))","v":""},null,null,{"$f":"IF(B52=\"\",\"\",VLOOKUP(B52,Lists!$AF$2:$AL$35,7,FALSE))","v":""},null,null,{"$f":"IF(B52=\"\",\"\",VLOOKUP(B52,Lists!$AF$2:$AK$35,6,FALSE))","v":""},null,{"$f":"IF($AA$33=\"Fall\",Lists!P123,Lists!L123)","v":""},null,{"$f":"IF($AA$33=\"Fall\",Lists!Q123,Lists!M123)","v":""},null,{"$f":"IF($AA$33=\"Fall\",Lists!R123,Lists!N123)","v":""},null,{"$f":"IF($AA$33=\"Fall\",Lists!S123,Lists!O123)","v":""},null,null,null,null,null,null,null,null,null,null,null,null,null,null,null,null,null,null,null,null,null,null,null,null,null,null,null,null,null,null,null,null,null,null,null,null,null,null,null,null,null,"IDA","West_Central",null,null,null,null,null,{"$f":"IF(CB52=\"\",\"\",IF($BD$22=10,VLOOKUP(CB52,Lists!$AF$2:$AJ$35,3,FALSE),IF('Seeding Plan'!$BD$22=20,VLOOKUP(CB52,Lists!$AF$2:$AJ$35,4,FALSE))))","v":""},null,"",null,null,null,null,null,null,null,"",null,"",null,null,{"$f":"IF(CB52=\"\",\"\",VLOOKUP(CB52,Lists!$AF$2:$AK$35,2,FALSE))","v":""},null,null,{"$f":"IF(CB52=\"\",\"\",VLOOKUP(CB52,Lists!$AF$2:$AL$35,7,FALSE))","v":""},null,null,{"$f":"IF(CB52=\"\",\"\",VLOOKUP(CB52,Lists!$AF$2:$AK$35,6,FALSE))","v":""},null,{"$f":"IF($AA$33=\"Fall\",Lists!CP123,Lists!CL123)","v":"00:00:00"},null,{"$f":"IF($AA$33=\"Fall\",Lists!CQ123,Lists!CM123)","v":"00:00:00"},null,{"$f":"IF($AA$33=\"Fall\",Lists!CR123,Lists!CN123)","v":"00:00:00"},null,{"$f":"IF($AA$33=\"Fall\",Lists!CS123,Lists!CO123)","v":"00:00:00"}]
[null,null,null,{"$f":"IF(B53=\"\",\"\",IF($BD$22=10,VLOOKUP(B53,Lists!$AF$2:$AJ$35,3,FALSE),IF('Seeding Plan'!$BD$22=20,VLOOKUP(B53,Lists!$AF$2:$AJ$35,4,FALSE))))","v":""},null,"",null,0.85,null,0.95,null,null,null,"",null,"",null,null,{"$f":"IF(B53=\"\",\"\",VLOOKUP(B53,Lists!$AF$2:$AK$35,2,FALSE))","v":""},null,null,{"$f":"IF(B53=\"\",\"\",VLOOKUP(B53,Lists!$AF$2:$AL$35,7,FALSE))","v":""},null,null,{"$f":"IF(B53=\"\",\"\",VLOOKUP(B53,Lists!$AF$2:$AK$35,6,FALSE))","v":""},null,{"$f":"IF($AA$33=\"Fall\",Lists!P124,Lists!L124)","v":""},null,{"$f":"IF($AA$33=\"Fall\",Lists!Q124,Lists!M124)","v":""},null,{"$f":"IF($AA$33=\"Fall\",Lists!R124,Lists!N124)","v":""},null,{"$f":"IF($AA$33=\"Fall\",Lists!S124,Lists!O124)","v":""},null,null,null,null,null,null,null,null,null,null,null,null,null,null,null,null,null,null,null,null,null,null,null,null,null,null,null,null,null,null,null,null,null,null,null,null,null,null,null,null,null,"IOWA","East_Central",null,null,null,null,null,{"$f":"IF(CB53=\"\",\"\",IF($BD$22=10,VLOOKUP(CB53,Lists!$AF$2:$AJ$35,3,FALSE),IF('Seeding Plan'!$BD$22=20,VLOOKUP(CB53,Lists!$AF$2:$AJ$35,4,FALSE))))","v":""},null,"",null,null,null,null,null,null,null,"",null,"",null,null,{"$f":"IF(CB53=\"\",\"\",VLOOKUP(CB53,Lists!$AF$2:$AK$35,2,FALSE))","v":""},null,null,{"$f":"IF(CB53=\"\",\"\",VLOOKUP(CB53,Lists!$AF$2:$AL$35,7,FALSE))","v":""},null,null,{"$f":"IF(CB53=\"\",\"\",VLOOKUP(CB53,Lists!$AF$2:$AK$35,6,FALSE))","v":""},null,{"$f":"IF($AA$33=\"Fall\",Lists!CP124,Lists!CL124)","v":"00:00:00"},null,{"$f":"IF($AA$33=\"Fall\",Lists!CQ124,Lists!CM124)","v":"00:00:00"},null,{"$f":"IF($AA$33=\"Fall\",Lists!CR124,Lists!CN124)","v":"00:00:00"},null,{"$f":"IF($AA$33=\"Fall\",Lists!CS124,Lists!CO124)","v":"00:00:00"}]
[null,null,null,{"$f":"IF(B54=\"\",\"\",IF($BD$22=10,VLOOKUP(B54,Lists!$AF$2:$AJ$35,3,FALSE),IF('Seeding Plan'!$BD$22=20,VLOOKUP(B54,Lists!$AF$2:$AJ$35,4,FALSE))))","v":""},null,"",null,0.85,null,0.95,null,null,null,"",null,"",null,null,{"$f":"IF(B54=\"\",\"\",VLOOKUP(B54,Lists!$AF$2:$AK$35,2,FALSE))","v":""},null,null,{"$f":"IF(B54=\"\",\"\",VLOOKUP(B54,Lists!$AF$2:$AL$35,7,FALSE))","v":""},null,null,{"$f":"IF(B54=\"\",\"\",VLOOKUP(B54,Lists!$AF$2:$AK$35,6,FALSE))","v":""},null,{"$f":"IF($AA$33=\"Fall\",Lists!P125,Lists!L125)","v":""},null,{"$f":"IF($AA$33=\"Fall\",Lists!Q125,Lists!M125)","v":""},null,{"$f":"IF($AA$33=\"Fall\",Lists!R125,Lists!N125)","v":""},null,{"$f":"IF($AA$33=\"Fall\",Lists!S125,Lists!O125)","v":""},null,null,null,null,null,null,null,null,null,null,null,null,null,null,null,null,null,null,null,null,null,null,null,null,null,null,null,null,null,null,null,null,null,null,null,null,null,null,null,null,null,"JACKSON","East_Central",null,null,null,null,null,{"$f":"IF(CB54=\"\",\"\",IF($BD$22=10,VLOOKUP(CB54,Lists!$AF$2:$AJ$35,3,FALSE),IF('Seeding Plan'!$BD$22=20,VLOOKUP(CB54,Lists!$AF$2:$AJ$35,4,FALSE))))","v":""},null,"",null,null,null,null,null,null,null,"",null,"",null,null,{"$f":"IF(CB54=\"\",\"\",VLOOKUP(CB54,Lists!$AF$2:$AK$35,2,FALSE))","v":""},null,null,{"$f":"IF(CB54=\"\",\"\",VLOOKUP(CB54,Lists!$AF$2:$AL$35,7,FALSE))","v":""},null,null,{"$f":"IF(CB54=\"\",\"\",VLOOKUP(CB54,Lists!$AF$2:$AK$35,6,FALSE))","v":""},null,{"$f":"IF($AA$33=\"Fall\",Lists!CP125,Lists!CL125)","v":"00:00:00"},null,{"$f":"IF($AA$33=\"Fall\",Lists!CQ125,Lists!CM125)","v":"00:00:00"},null,{"$f":"IF($AA$33=\"Fall\",Lists!CR125,Lists!CN125)","v":"00:00:00"},null,{"$f":"IF($AA$33=\"Fall\",Lists!CS125,Lists!CO125)","v":"00:00:00"}]
[null,null,null,{"$f":"IF(B55=\"\",\"\",IF($BD$22=10,VLOOKUP(B55,Lists!$AF$2:$AJ$35,3,FALSE),IF('Seeding Plan'!$BD$22=20,VLOOKUP(B55,Lists!$AF$2:$AJ$35,4,FALSE))))","v":""},null,"",null,0.85,null,0.95,null,null,null,"",null,"",null,null,{"$f":"IF(B55=\"\",\"\",VLOOKUP(B55,Lists!$AF$2:$AK$35,2,FALSE))","v":""},null,null,{"$f":"IF(B55=\"\",\"\",VLOOKUP(B55,Lists!$AF$2:$AL$35,7,FALSE))","v":""},null,null,{"$f":"IF(B55=\"\",\"\",VLOOKUP(B55,Lists!$AF$2:$AK$35,6,FALSE))","v":""},null,{"$f":"IF($AA$33=\"Fall\",Lists!P126,Lists!L126)","v":""},null,{"$f":"IF($AA$33=\"Fall\",Lists!Q126,Lists!M126)","v":""},null,{"$f":"IF($AA$33=\"Fall\",Lists!R126,Lists!N126)","v":""},null,{"$f":"IF($AA$33=\"Fall\",Lists!S126,Lists!O126)","v":""},null,null,null,null,null,null,null,null,null,null,null,null,null,null,null,null,null,null,null,null,null,null,null,null,null,null,null,null,null,null,null,null,null,null,null,null,null,null,null,null,null,"JASPER","Central",null,null,null,null,null,{"$f":"IF(CB55=\"\",\"\",IF($BD$22=10,VLOOKUP(CB55,Lists!$AF$2:$AJ$35,3,FALSE),IF('Seeding Plan'!$BD$22=20,VLOOKUP(CB55,Lists!$AF$2:$AJ$35,4,FALSE))))","v":""},null,"",null,null,null,null,null,null,null,"",null,"",null,null,{"$f":"IF(CB55=\"\",\"\",VLOOKUP(CB55,Lists!$AF$2:$AK$35,2,FALSE))","v":""},null,null,{"$f":"IF(CB55=\"\",\"\",VLOOKUP(CB55,Lists!$AF$2:$AL$35,7,FALSE))","v":""},null,null,{"$f":"IF(CB55=\"\",\"\",VLOOKUP(CB55,Lists!$AF$2:$AK$35,6,FALSE))","v":""},null,{"$f":"IF($AA$33=\"Fall\",Lists!CP126,Lists!CL126)","v":"00:00:00"},null,{"$f":"IF($AA$33=\"Fall\",Lists!CQ126,Lists!CM126)","v":"00:00:00"},null,{"$f":"IF($AA$33=\"Fall\",Lists!CR126,Lists!CN126)","v":"00:00:00"},null,{"$f":"IF($AA$33=\"Fall\",Lists!CS126,Lists!CO126)","v":"00:00:00"}]
[null,null,null,"Full Seed Rate #/ac",null,"Acres",null,"Germ %",null,"Purity %",null,"% of Full Rate/Mix",null,"Rate lb./ac",null,"Total lbs.",null,null,"Planting Depth (in)",null,null,"Approx. Low Temp. Tolerance",null,null,"Crop Type",null,"Start",null,"Start Prime",null,"End Prime",null,"End ",null,null,null,null,null,null,null,null,null,null,null,null,null,null,null,null,null,null,null,null,null,null,null,null,null,null,null,null,null,null,null,null,null,null,null,null,null,null,null,null,null,"JEFFERSON","Southeast"]
[null,null,null,null,null,{"$f":"IF(B57=\"\",\"\",+$V$8)","v":""},null,0.85,null,0.95,null,null,null,{"$f":"IF(B57=\"\",\"\",IF((H57*J57>0.79999999),L57*D57,(L57*D57)/(H57*J57)))","v":""},null,{"$f":"+IF(B57=\"\",\"\",N57*F57)","v":""},null,null,null,null,null,null,null,null,null,null,null,null,null,null,null,null,null,null,null,null,null,null,null,null,null,null,null,null,null,null,null,null,null,null,null,null,null,null,null,null,null,null,null,null,null,null,null,null,null,null,null,null,null,null,null,null,null,null,"JOHNSON","East_Central"]
[null,null,null,null,null,"",null,0.85,null,0.95,null,null,null,"",null,{"$f":"+IF(B58=\"\",\"\",N58*F58)","v":""},null,null,null,null,null,null,null,null,null,null,null,null,null,null,null,null,null,null,null,null,null,null,null,null,null,null,null,null,null,null,null,null,null,null,null,null,null,null,null,null,null,null,null,null,null,null,null,null,null,null,null,null,null,null,null,null,null,null,"JONES","East_Central"]
[null,null,null,null,null,"",null,0.85,null,0.95,null,null,null,"",null,{"$f":"+IF(B59=\"\",\"\",N59*F59)","v":""},null,null,null,null,null,null,null,null,null,null,null,null,null,null,null,null,null,null,null,null,null,null,null,null,null,null,null,null,null,null,null,null,null,null,null,null,null,null,null,null,null,null,null,null,null,null,null,null,null,null,null,null,null,null,null,null,null,null,"KEOKUK","Southeast"]
[null,null,null,null,null,"",null,0.85,null,0.95,null,null,null,"",null,"",null,null,null,null,null,null,null,null,null,null,null,null,null,null,null,null,null,null,null,null,null,null,null,null,null,null,null,null,null,null,null,null,null,null,null,null,null,null,null,null,null,null,null,null,null,null,null,null,null,null,null,null,null,null,null,null,null,null,"KOSSUTH","North_Central"]
[null,"-",null,null,null,null,null,null,null,null,null,{"$f":"SUM(L36:L60)","v":0},null,{"$f":"SUM(N36:O55)","v":0},null,"lbs. per Acre",null,null,null,{"$f":"SUM(P36:P55)","v":0},null,null,"Total Pounds",null,null,null,null,null,null,null,null,null,null,null,null,null,null,null,null,null,null,null,null,null,null,null,null,null,null,null,null,null,null,null,null,null,null,null,null,null,null,null,null,null,null,null,null,null,null,null,null,null,null,null,"LEE","Southeast"]
[null,"Blank Row",null,null,null,null,null,null,null,null,null,null,null,null,null,null,null,null,null,null,null,null,null,null,null,null,null,null,null,null,null,null,null,null,null,null,null,null,null,null,null,null,null,null,null,null,null,null,null,null,null,null,null,null,null,null,null,null,null,null,null,null,null,null,null,null,null,null,null,null,null,null,null,null,"LINN","East_Central"]
[null,"Seeding Window",null,null,null,null,null,null,null,null,null,null,null,null,null,null,null,null,null,null,null,null,null,null,null,null,null,null,null,null,null,null,null,null,null,null,null,null,null,null,null,null,null,null,null,null,null,null,null,null,null,null,null,null,null,null,null,null,null,null,null,null,null,null,null,null,null,null,null,null,null,null,null,null,"LOUISA","Southeast"]
[null,"-","March",null,"April",null,null,null,"May",null,null,null,"June",null,null,null,"July",null,null,null,"August",null,null,null,"September",null,null,null,"October",null,null,null,"November",null,null,null,null,null,null,null,null,null,null,null,null,null,null,null,null,null,null,null,null,null,null,null,null,null,null,null,null,null,null,null,null,null,null,null,null,null,null,null,null,null,"LUCAS","South_Central"]
[null,{"$f":"IF(B36=\"\",\"\",B36)","v":""},{"$f":"IF($B$36=\"\",\"\",IF($C$8=\"Northwest\",VLOOKUP($B$36,Northwest,2,FALSE),IF($C$8=\"North_Central\",VLOOKUP($B$36,North_Central,2,FALSE),IF($C$8=\"Northeast\",VLOOKUP($B$36,Northeast,2,FALSE),IF($C$8=\"West_Central\",VLOOKUP($B$36,West_Central,2,FALSE),IF($C$8=\"Central\",VLOOKUP($B$36,Central,2,FALSE), IF($C$8=\"East_Central\",VLOOKUP($B$36,East_Central,2,FALSE), IF($C$8=\"Southwest\",VLOOKUP($B$36,Southwest,2,FALSE), IF($C$8=\"South_Central\",VLOOKUP($B$36,South_Central,2,FALSE),IF($C$8=\"Southeast\",VLOOKUP($B$36,Southeast,2,FALSE)))))))))))","v":""},{"$f":"IF(B36=\"\",\"\",IF($C$8=\"Northwest\",VLOOKUP(B36,Northwest,3,FALSE),IF($C$8=\"North_Central\",VLOOKUP(B36,North_Central,3,FALSE),IF($C$8=\"Northeast\",VLOOKUP(B36,Northeast,3,FALSE),IF($C$8=\"West_Central\",VLOOKUP(B36,West_Central,3,FALSE),IF($C$8=\"Central\",VLOOKUP(B36,Central,3,FALSE), IF($C$8=\"East_Central\",VLOOKUP(B36,East_Central,3,FALSE), IF($C$8=\"Southwest\",VLOOKUP(B36,Southwest,3,FALSE), IF($C$8=\"South_Central\",VLOOKUP(B36,South_Central,3,FALSE),IF($C$8=\"Southeast\",VLOOKUP(B36,Southeast,3,FALSE)))))))))))","v":""},{"$f":"IF(B36=\"\",\"\",IF($C$8=\"Northwest\",VLOOKUP(B36,Northwest,4,FALSE),IF($C$8=\"North_Central\",VLOOKUP(B36,North_Central,4,FALSE),IF($C$8=\"Northeast\",VLOOKUP(B36,Northeast,4,FALSE),IF($C$8=\"West_Central\",VLOOKUP(B36,West_Central,4,FALSE),IF($C$8=\"Central\",VLOOKUP(B36,Central,4,FALSE), IF($C$8=\"East_Central\",VLOOKUP(B36,East_Central,4,FALSE), IF($C$8=\"Southwest\",VLOOKUP(B36,Southwest,4,FALSE), IF($C$8=\"South_Central\",VLOOKUP(B36,South_Central,4,FALSE),IF($C$8=\"Southeast\",VLOOKUP(B36,Southeast,4,FALSE)))))))))))","v":""},{"$f":"IF(B36=\"\",\"\",IF($C$8=\"Northwest\",VLOOKUP(B36,Northwest,5,FALSE),IF($C$8=\"North_Central\",VLOOKUP(B36,North_Central,5,FALSE),IF($C$8=\"Northeast\",VLOOKUP(B36,Northeast,5,FALSE),IF($C$8=\"West_Central\",VLOOKUP(B36,West_Central,5,FALSE),IF($C$8=\"Central\",VLOOKUP(B36,Central,5,FALSE), IF($C$8=\"East_Central\",VLOOKUP(B36,East_Central,5,FALSE), IF($C$8=\"Southwest\",VLOOKUP(B36,Southwest,5,FALSE), IF($C$8=\"South_Central\",VLOOKUP(B36,South_Central,5,FALSE),IF($C$8=\"Southeast\",VLOOKUP(B36,Southeast,5,FALSE)))))))))))","v":""},{"$f":"IF(B36=\"\",\"\",IF($C$8=\"Northwest\",VLOOKUP(B36,Northwest,6,FALSE),IF($C$8=\"North_Central\",VLOOKUP(B36,North_Central,6,FALSE),IF($C$8=\"Northeast\",VLOOKUP(B36,Northeast,6,FALSE),IF($C$8=\"West_Central\",VLOOKUP(B36,West_Central,6,FALSE),IF($C$8=\"Central\",VLOOKUP(B36,Central,6,FALSE), IF($C$8=\"East_Central\",VLOOKUP(B36,East_Central,6,FALSE), IF($C$8=\"Southwest\",VLOOKUP(B36,Southwest,6,FALSE), IF($C$8=\"South_Central\",VLOOKUP(B36,South_Central,6,FALSE),IF($C$8=\"Southeast\",VLOOKUP(B36,Southeast,6,FALSE)))))))))))","v":""},{"$f":"IF(B36=\"\",\"\",IF($C$8=\"Northwest\",VLOOKUP(B36,Northwest,7,FALSE),IF($C$8=\"North_Central\",VLOOKUP(B36,North_Central,7,FALSE),IF($C$8=\"Northeast\",VLOOKUP(B36,Northeast,7,FALSE),IF($C$8=\"West_Central\",VLOOKUP(B36,West_Central,7,FALSE),IF($C$8=\"Central\",VLOOKUP(B36,Central,7,FALSE), IF($C$8=\"East_Central\",VLOOKUP(B36,East_Central,7,FALSE), IF($C$8=\"Southwest\",VLOOKUP(B36,Southwest,7,FALSE), IF($C$8=\"South_Central\",VLOOKUP(B36,South_Central,7,FALSE),IF($C$8=\"Southeast\",VLOOKUP(B36,Southeast,7,FALSE)))))))))))","v":""},{"$f":"IF(B36=\"\",\"\",IF($C$8=\"Northwest\",VLOOKUP(B36,Northwest,8,FALSE),IF($C$8=\"North_Central\",VLOOKUP(B36,North_Central,8,FALSE),IF($C$8=\"Northeast\",VLOOKUP(B36,Northeast,8,FALSE),IF($C$8=\"West_Central\",VLOOKUP(B36,West_Central,8,FALSE),IF($C$8=\"Central\",VLOOKUP(B36,Central,8,FALSE), IF($C$8=\"East_Central\",VLOOKUP(B36,East_Central,8,FALSE), IF($C$8=\"Southwest\",VLOOKUP(B36,Southwest,8,FALSE), IF($C$8=\"South_Central\",VLOOKUP(B36,South_Central,8,FALSE),IF($C$8=\"Southeast\",VLOOKUP(B36,Southeast,8,FALSE)))))))))))","v":""},{"$f":"IF(B36=\"\",\"\",IF($C$8=\"Northwest\",VLOOKUP(B36,Northwest,9,FALSE),IF($C$8=\"North_Central\",VLOOKUP(B36,North_Central,9,FALSE),IF($C$8=\"Northeast\",VLOOKUP(B36,Northeast,9,FALSE),IF($C$8=\"West_Central\",VLOOKUP(B36,West_Central,9,FALSE),IF($C$8=\"Central\",VLOOKUP(B36,Central,9,FALSE), IF($C$8=\"East_Central\",VLOOKUP(B36,East_Central,9,FALSE), IF($C$8=\"Southwest\",VLOOKUP(B36,Southwest,9,FALSE), IF($C$8=\"South_Central\",VLOOKUP(B36,South_Central,9,FALSE),IF($C$8=\"Southeast\",VLOOKUP(B36,Southeast,9,FALSE)))))))))))","v":""},{"$f":"IF(B36=\"\",\"\",IF($C$8=\"Northwest\",VLOOKUP(B36,Northwest,10,FALSE),IF($C$8=\"North_Central\",VLOOKUP(B36,North_Central,10,FALSE),IF($C$8=\"Northeast\",VLOOKUP(B36,Northeast,10,FALSE),IF($C$8=\"West_Central\",VLOOKUP(B36,West_Central,10,FALSE),IF($C$8=\"Central\",VLOOKUP(B36,Central,10,FALSE), IF($C$8=\"East_Central\",VLOOKUP(B36,East_Central,10,FALSE), IF($C$8=\"Southwest\",VLOOKUP(B36,Southwest,10,FALSE), IF($C$8=\"South_Central\",VLOOKUP(B36,South_Central,10,FALSE),IF($C$8=\"Southeast\",VLOOKUP(B36,Southeast,10,FALSE)))))))))))","v":""},{"$f":"IF(B36=\"\",\"\",IF($C$8=\"Northwest\",VLOOKUP(B36,Northwest,11,FALSE),IF($C$8=\"North_Central\",VLOOKUP(B36,North_Central,11,FALSE),IF($C$8=\"Northeast\",VLOOKUP(B36,Northeast,11,FALSE),IF($C$8=\"West_Central\",VLOOKUP(B36,West_Central,11,FALSE),IF($C$8=\"Central\",VLOOKUP(B36,Central,11,FALSE), IF($C$8=\"East_Central\",VLOOKUP(B36,East_Central,11,FALSE), IF($C$8=\"Southwest\",VLOOKUP(B36,Southwest,11,FALSE), IF($C$8=\"South_Central\",VLOOKUP(B36,South_Central,11,FALSE),IF($C$8=\"Southeast\",VLOOKUP(B36,Southeast,11,FALSE)))))))))))","v":""},{"$f":"IF(B36=\"\",\"\",IF($C$8=\"Northwest\",VLOOKUP(B36,Northwest,12,FALSE),IF($C$8=\"North_Central\",VLOOKUP(B36,North_Central,12,FALSE),IF($C$8=\"Northeast\",VLOOKUP(B36,Northeast,12,FALSE),IF($C$8=\"West_Central\",VLOOKUP(B36,West_Central,12,FALSE),IF($C$8=\"Central\",VLOOKUP(B36,Central,12,FALSE), IF($C$8=\"East_Central\",VLOOKUP(B36,East_Central,12,FALSE), IF($C$8=\"Southwest\",VLOOKUP(B36,Southwest,12,FALSE), IF($C$8=\"South_Central\",VLOOKUP(B36,South_Central,12,FALSE),IF($C$8=\"Southeast\",VLOOKUP(B36,Southeast,12,FALSE)))))))))))","v":""},{"$f":"IF(B36=\"\",\"\",IF($C$8=\"Northwest\",VLOOKUP(B36,Northwest,13,FALSE),IF($C$8=\"North_Central\",VLOOKUP(B36,North_Central,13,FALSE),IF($C$8=\"Northeast\",VLOOKUP(B36,Northeast,13,FALSE),IF($C$8=\"West_Central\",VLOOKUP(B36,West_Central,13,FALSE),IF($C$8=\"Central\",VLOOKUP(B36,Central,13,FALSE), IF($C$8=\"East_Central\",VLOOKUP(B36,East_Central,13,FALSE), IF($C$8=\"Southwest\",VLOOKUP(B36,Southwest,13,FALSE), IF($C$8=\"South_Central\",VLOOKUP(B36,South_Central,13,FALSE),IF($C$8=\"Southeast\",VLOOKUP(B36,Southeast,13,FALSE)))))))))))","v":""},{"$f":"IF($B36=\"\",\"\",IF($C$8=\"Northwest\",VLOOKUP($B36,Northwest,14,FALSE),IF($C$8=\"North_Central\",VLOOKUP($B36,North_Central,14,FALSE),IF($C$8=\"Northeast\",VLOOKUP($B36,Northeast,14,FALSE),IF($C$8=\"West_Central\",VLOOKUP($B36,West_Central,14,FALSE),IF($C$8=\"Central\",VLOOKUP($B36,Central,14,FALSE), IF($C$8=\"East_Central\",VLOOKUP($B36,East_Central,14,FALSE), IF($C$8=\"Southwest\",VLOOKUP($B36,Southwest,14,FALSE), IF($C$8=\"South_Central\",VLOOKUP($B36,South_Central,14,FALSE),IF($C$8=\"Southeast\",VLOOKUP($B36,Southeast,14,FALSE)))))))))))","v":""},{"$f":"IF($B36=\"\",\"\",IF($C$8=\"Northwest\",VLOOKUP($B36,Northwest,15,FALSE),IF($C$8=\"North_Central\",VLOOKUP($B36,North_Central,15,FALSE),IF($C$8=\"Northeast\",VLOOKUP($B36,Northeast,15,FALSE),IF($C$8=\"West_Central\",VLOOKUP($B36,West_Central,15,FALSE),IF($C$8=\"Central\",VLOOKUP($B36,Central,15,FALSE), IF($C$8=\"East_Central\",VLOOKUP($B36,East_Central,15,FALSE), IF($C$8=\"Southwest\",VLOOKUP($B36,Southwest,15,FALSE), IF($C$8=\"South_Central\",VLOOKUP($B36,South_Central,15,FALSE),IF($C$8=\"Southeast\",VLOOKUP($B36,Southeast,15,FALSE)))))))))))","v":""},{"$f":"IF($B36=\"\",\"\",IF($C$8=\"Northwest\",VLOOKUP($B36,Northwest,15,FALSE),IF($C$8=\"North_Central\",VLOOKUP($B36,North_Central,15,FALSE),IF($C$8=\"Northeast\",VLOOKUP($B36,Northeast,15,FALSE),IF($C$8=\"West_Central\",VLOOKUP($B36,West_Central,15,FALSE),IF($C$8=\"Central\",VLOOKUP($B36,Central,15,FALSE), IF($C$8=\"East_Central\",VLOOKUP($B36,East_Central,15,FALSE), IF($C$8=\"Southwest\",VLOOKUP($B36,Southwest,15,FALSE), IF($C$8=\"South_Central\",VLOOKUP($B36,South_Central,15,FALSE),IF($C$8=\"Southeast\",VLOOKUP($B36,Southeast,15,FALSE)))))))))))","v":""},{"$f":"IF($B36=\"\",\"\",IF($C$8=\"Northwest\",VLOOKUP($B36,Northwest,17,FALSE),IF($C$8=\"North_Central\",VLOOKUP($B36,North_Central,17,FALSE),IF($C$8=\"Northeast\",VLOOKUP($B36,Northeast,17,FALSE),IF($C$8=\"West_Central\",VLOOKUP($B36,West_Central,17,FALSE),IF($C$8=\"Central\",VLOOKUP($B36,Central,17,FALSE), IF($C$8=\"East_Central\",VLOOKUP($B36,East_Central,17,FALSE), IF($C$8=\"Southwest\",VLOOKUP($B36,Southwest,17,FALSE), IF($C$8=\"South_Central\",VLOOKUP($B36,South_Central,17,FALSE),IF($C$8=\"Southeast\",VLOOKUP($B36,Southeast,17,FALSE)))))))))))","v":""},{"$f":"IF($B36=\"\",\"\",IF($C$8=\"Northwest\",VLOOKUP($B36,Northwest,18,FALSE),IF($C$8=\"North_Central\",VLOOKUP($B36,North_Central,18,FALSE),IF($C$8=\"Northeast\",VLOOKUP($B36,Northeast,18,FALSE),IF($C$8=\"West_Central\",VLOOKUP($B36,West_Central,18,FALSE),IF($C$8=\"Central\",VLOOKUP($B36,Central,18,FALSE), IF($C$8=\"East_Central\",VLOOKUP($B36,East_Central,18,FALSE), IF($C$8=\"Southwest\",VLOOKUP($B36,Southwest,18,FALSE), IF($C$8=\"South_Central\",VLOOKUP($B36,South_Central,18,FALSE),IF($C$8=\"Southeast\",VLOOKUP($B36,Southeast,18,FALSE)))))))))))","v":""},{"$f":"IF($B36=\"\",\"\",IF($C$8=\"Northwest\",VLOOKUP($B36,Northwest,19,FALSE),IF($C$8=\"North_Central\",VLOOKUP($B36,North_Central,19,FALSE),IF($C$8=\"Northeast\",VLOOKUP($B36,Northeast,19,FALSE),IF($C$8=\"West_Central\",VLOOKUP($B36,West_Central,19,FALSE),IF($C$8=\"Central\",VLOOKUP($B36,Central,19,FALSE), IF($C$8=\"East_Central\",VLOOKUP($B36,East_Central,19,FALSE), IF($C$8=\"Southwest\",VLOOKUP($B36,Southwest,19,FALSE), IF($C$8=\"South_Central\",VLOOKUP($B36,South_Central,19,FALSE),IF($C$8=\"Southeast\",VLOOKUP($B36,Southeast,19,FALSE)))))))))))","v":""},{"$f":"IF($B36=\"\",\"\",IF($C$8=\"Northwest\",VLOOKUP($B36,Northwest,20,FALSE),IF($C$8=\"North_Central\",VLOOKUP($B36,North_Central,20,FALSE),IF($C$8=\"Northeast\",VLOOKUP($B36,Northeast,20,FALSE),IF($C$8=\"West_Central\",VLOOKUP($B36,West_Central,20,FALSE),IF($C$8=\"Central\",VLOOKUP($B36,Central,20,FALSE), IF($C$8=\"East_Central\",VLOOKUP($B36,East_Central,20,FALSE), IF($C$8=\"Southwest\",VLOOKUP($B36,Southwest,20,FALSE), IF($C$8=\"South_Central\",VLOOKUP($B36,South_Central,20,FALSE),IF($C$8=\"Southeast\",VLOOKUP($B36,Southeast,20,FALSE)))))))))))","v":""},{"$f":"IF($B36=\"\",\"\",IF($C$8=\"Northwest\",VLOOKUP($B36,Northwest,21,FALSE),IF($C$8=\"North_Central\",VLOOKUP($B36,North_Central,21,FALSE),IF($C$8=\"Northeast\",VLOOKUP($B36,Northeast,21,FALSE),IF($C$8=\"West_Central\",VLOOKUP($B36,West_Central,21,FALSE),IF($C$8=\"Central\",VLOOKUP($B36,Central,21,FALSE), IF($C$8=\"East_Central\",VLOOKUP($B36,East_Central,21,FALSE), IF($C$8=\"Southwest\",VLOOKUP($B36,Southwest,21,FALSE), IF($C$8=\"South_Central\",VLOOKUP($B36,South_Central,21,FALSE),IF($C$8=\"Southeast\",VLOOKUP($B36,Southeast,21,FALSE)))))))))))","v":""},{"$f":"IF($B36=\"\",\"\",IF($C$8=\"Northwest\",VLOOKUP($B36,Northwest,22,FALSE),IF($C$8=\"North_Central\",VLOOKUP($B36,North_Central,22,FALSE),IF($C$8=\"Northeast\",VLOOKUP($B36,Northeast,22,FALSE),IF($C$8=\"West_Central\",VLOOKUP($B36,West_Central,22,FALSE),IF($C$8=\"Central\",VLOOKUP($B36,Central,22,FALSE), IF($C$8=\"East_Central\",VLOOKUP($B36,East_Central,22,FALSE), IF($C$8=\"Southwest\",VLOOKUP($B36,Southwest,22,FALSE), IF($C$8=\"South_Central\",VLOOKUP($B36,South_Central,22,FALSE),IF($C$8=\"Southeast\",VLOOKUP($B36,Southeast,22,FALSE)))))))))))","v":""},{"$f":"IF($B36=\"\",\"\",IF($C$8=\"Northwest\",VLOOKUP($B36,Northwest,23,FALSE),IF($C$8=\"North_Central\",VLOOKUP($B36,North_Central,23,FALSE),IF($C$8=\"Northeast\",VLOOKUP($B36,Northeast,23,FALSE),IF($C$8=\"West_Central\",VLOOKUP($B36,West_Central,23,FALSE),IF($C$8=\"Central\",VLOOKUP($B36,Central,23,FALSE), IF($C$8=\"East_Central\",VLOOKUP($B36,East_Central,23,FALSE), IF($C$8=\"Southwest\",VLOOKUP($B36,Southwest,23,FALSE), IF($C$8=\"South_Central\",VLOOKUP($B36,South_Central,23,FALSE),IF($C$8=\"Southeast\",VLOOKUP($B36,Southeast,23,FALSE)))))))))))","v":""},{"$f":"IF($B36=\"\",\"\",IF($C$8=\"Northwest\",VLOOKUP($B36,Northwest,24,FALSE),IF($C$8=\"North_Central\",VLOOKUP($B36,North_Central,24,FALSE),IF($C$8=\"Northeast\",VLOOKUP($B36,Northeast,24,FALSE),IF($C$8=\"West_Central\",VLOOKUP($B36,West_Central,24,FALSE),IF($C$8=\"Central\",VLOOKUP($B36,Central,24,FALSE), IF($C$8=\"East_Central\",VLOOKUP($B36,East_Central,24,FALSE), IF($C$8=\"Southwest\",VLOOKUP($B36,Southwest,24,FALSE), IF($C$8=\"South_Central\",VLOOKUP($B36,South_Central,24,FALSE),IF($C$8=\"Southeast\",VLOOKUP($B36,Southeast,24,FALSE)))))))))))","v":""},{"$f":"IF($B36=\"\",\"\",IF($C$8=\"Northwest\",VLOOKUP($B36,Northwest,25,FALSE),IF($C$8=\"North_Central\",VLOOKUP($B36,North_Central,25,FALSE),IF($C$8=\"Northeast\",VLOOKUP($B36,Northeast,25,FALSE),IF($C$8=\"West_Central\",VLOOKUP($B36,West_Central,25,FALSE),IF($C$8=\"Central\",VLOOKUP($B36,Central,25,FALSE), IF($C$8=\"East_Central\",VLOOKUP($B36,East_Central,25,FALSE), IF($C$8=\"Southwest\",VLOOKUP($B36,Southwest,25,FALSE), IF($C$8=\"South_Central\",VLOOKUP($B36,South_Central,25,FALSE),IF($C$8=\"Southeast\",VLOOKUP($B36,Southeast,25,FALSE)))))))))))","v":""},{"$f":"IF($B36=\"\",\"\",IF($C$8=\"Northwest\",VLOOKUP($B36,Northwest,26,FALSE),IF($C$8=\"North_Central\",VLOOKUP($B36,North_Central,26,FALSE),IF($C$8=\"Northeast\",VLOOKUP($B36,Northeast,26,FALSE),IF($C$8=\"West_Central\",VLOOKUP($B36,West_Central,26,FALSE),IF($C$8=\"Central\",VLOOKUP($B36,Central,26,FALSE), IF($C$8=\"East_Central\",VLOOKUP($B36,East_Central,26,FALSE), IF($C$8=\"Southwest\",VLOOKUP($B36,Southwest,26,FALSE), IF($C$8=\"South_Central\",VLOOKUP($B36,South_Central,26,FALSE),IF($C$8=\"Southeast\",VLOOKUP($B36,Southeast,26,FALSE)))))))))))","v":""},{"$f":"IF($B36=\"\",\"\",IF($C$8=\"Northwest\",VLOOKUP($B36,Northwest,27,FALSE),IF($C$8=\"North_Central\",VLOOKUP($B36,North_Central,27,FALSE),IF($C$8=\"Northeast\",VLOOKUP($B36,Northeast,27,FALSE),IF($C$8=\"West_Central\",VLOOKUP($B36,West_Central,27,FALSE),IF($C$8=\"Central\",VLOOKUP($B36,Central,27,FALSE), IF($C$8=\"East_Central\",VLOOKUP($B36,East_Central,27,FALSE), IF($C$8=\"Southwest\",VLOOKUP($B36,Southwest,27,FALSE), IF($C$8=\"South_Central\",VLOOKUP($B36,South_Central,27,FALSE),IF($C$8=\"Southeast\",VLOOKUP($B36,Southeast,27,FALSE)))))))))))","v":""},{"$f":"IF($B36=\"\",\"\",IF($C$8=\"Northwest\",VLOOKUP($B36,Northwest,28,FALSE),IF($C$8=\"North_Central\",VLOOKUP($B36,North_Central,28,FALSE),IF($C$8=\"Northeast\",VLOOKUP($B36,Northeast,28,FALSE),IF($C$8=\"West_Central\",VLOOKUP($B36,West_Central,28,FALSE),IF($C$8=\"Central\",VLOOKUP($B36,Central,28,FALSE), IF($C$8=\"East_Central\",VLOOKUP($B36,East_Central,28,FALSE), IF($C$8=\"Southwest\",VLOOKUP($B36,Southwest,28,FALSE), IF($C$8=\"South_Central\",VLOOKUP($B36,South_Central,28,FALSE),IF($C$8=\"Southeast\",VLOOKUP($B36,Southeast,28,FALSE)))))))))))","v":""},{"$f":"IF($B36=\"\",\"\",IF($C$8=\"Northwest\",VLOOKUP($B36,Northwest,29,FALSE),IF($C$8=\"North_Central\",VLOOKUP($B36,North_Central,29,FALSE),IF($C$8=\"Northeast\",VLOOKUP($B36,Northeast,29,FALSE),IF($C$8=\"West_Central\",VLOOKUP($B36,West_Central,29,FALSE),IF($C$8=\"Central\",VLOOKUP($B36,Central,29,FALSE), IF($C$8=\"East_Central\",VLOOKUP($B36,East_Central,29,FALSE), IF($C$8=\"Southwest\",VLOOKUP($B36,Southwest,29,FALSE), IF($C$8=\"South_Central\",VLOOKUP($B36,South_Central,29,FALSE),IF($C$8=\"Southeast\",VLOOKUP($B36,Southeast,29,FALSE)))))))))))","v":""},{"$f":"IF($B36=\"\",\"\",IF($C$8=\"Northwest\",VLOOKUP($B36,Northwest,30,FALSE),IF($C$8=\"North_Central\",VLOOKUP($B36,North_Central,30,FALSE),IF($C$8=\"Northeast\",VLOOKUP($B36,Northeast,30,FALSE),IF($C$8=\"West_Central\",VLOOKUP($B36,West_Central,30,FALSE),IF($C$8=\"Central\",VLOOKUP($B36,Central,30,FALSE), IF($C$8=\"East_Central\",VLOOKUP($B36,East_Central,30,FALSE), IF($C$8=\"Southwest\",VLOOKUP($B36,Southwest,30,FALSE), IF($C$8=\"South_Central\",VLOOKUP($B36,South_Central,30,FALSE),IF($C$8=\"Southeast\",VLOOKUP($B36,Southeast,30,FALSE)))))))))))","v":""},{"$f":"IF($B36=\"\",\"\",IF($C$8=\"Northwest\",VLOOKUP($B36,Northwest,31,FALSE),IF($C$8=\"North_Central\",VLOOKUP($B36,North_Central,31,FALSE),IF($C$8=\"Northeast\",VLOOKUP($B36,Northeast,31,FALSE),IF($C$8=\"West_Central\",VLOOKUP($B36,West_Central,31,FALSE),IF($C$8=\"Central\",VLOOKUP($B36,Central,31,FALSE), IF($C$8=\"East_Central\",VLOOKUP($B36,East_Central,31,FALSE), IF($C$8=\"Southwest\",VLOOKUP($B36,Southwest,31,FALSE), IF($C$8=\"South_Central\",VLOOKUP($B36,South_Central,31,FALSE),IF($C$8=\"Southeast\",VLOOKUP($B36,Southeast,31,FALSE)))))))))))","v":""},{"$f":"IF($B36=\"\",\"\",IF($C$8=\"Northwest\",VLOOKUP($B36,Northwest,32,FALSE),IF($C$8=\"North_Central\",VLOOKUP($B36,North_Central,32,FALSE),IF($C$8=\"Northeast\",VLOOKUP($B36,Northeast,32,FALSE),IF($C$8=\"West_Central\",VLOOKUP($B36,West_Central,32,FALSE),IF($C$8=\"Central\",VLOOKUP($B36,Central,32,FALSE), IF($C$8=\"East_Central\",VLOOKUP($B36,East_Central,32,FALSE), IF($C$8=\"Southwest\",VLOOKUP($B36,Southwest,32,FALSE), IF($C$8=\"South_Central\",VLOOKUP($B36,South_Central,32,FALSE),IF($C$8=\"Southeast\",VLOOKUP($B36,Southeast,32,FALSE)))))))))))","v":""},{"$f":"IF($B36=\"\",\"\",IF($C$8=\"Northwest\",VLOOKUP($B36,Northwest,33,FALSE),IF($C$8=\"North_Central\",VLOOKUP($B36,North_Central,33,FALSE),IF($C$8=\"Northeast\",VLOOKUP($B36,Northeast,33,FALSE),IF($C$8=\"West_Central\",VLOOKUP($B36,West_Central,33,FALSE),IF($C$8=\"Central\",VLOOKUP($B36,Central,33,FALSE), IF($C$8=\"East_Central\",VLOOKUP($B36,East_Central,33,FALSE), IF($C$8=\"Southwest\",VLOOKUP($B36,Southwest,33,FALSE), IF($C$8=\"South_Central\",VLOOKUP($B36,South_Central,33,FALSE),IF($C$8=\"Southeast\",VLOOKUP($B36,Southeast,33,FALSE)))))))))))","v":""},null,null,null,null,null,null,null,null,null,null,null,null,null,null,null,null,null,null,null,null,null,null,null,null,null,null,null,null,null,null,null,null,null,null,null,null,null,null,null,null,"LYON","Northwest"]
[null,"",{"$f":"IF(B37=\"\",\"\",IF($C$8=\"Northwest\",VLOOKUP(B37,Northwest,2,FALSE),IF($C$8=\"North_Central\",VLOOKUP(B37,North_Central,2,FALSE),IF($C$8=\"Northeast\",VLOOKUP(B37,Northeast,2,FALSE),IF($C$8=\"West_Central\",VLOOKUP(B37,West_Central,2,FALSE),IF($C$8=\"Central\",VLOOKUP(B37,Central,2,FALSE), IF($C$8=\"East_Central\",VLOOKUP(B37,East_Central,2,FALSE), IF($C$8=\"Southwest\",VLOOKUP(B37,Southwest,2,FALSE), IF($C$8=\"South_Central\",VLOOKUP(B37,South_Central,2,FALSE),IF($C$8=\"Southeast\",VLOOKUP(B37,Southeast,2,FALSE)))))))))))","v":""},"","","","","","","","","","","","",{"$f":"IF($B37=\"\",\"\",IF($C$8=\"Northwest\",VLOOKUP($B37,Northwest,15,FALSE),IF($C$8=\"North_Central\",VLOOKUP($B37,North_Central,15,FALSE),IF($C$8=\"Northeast\",VLOOKUP($B37,Northeast,15,FALSE),IF($C$8=\"West_Central\",VLOOKUP($B37,West_Central,15,FALSE),IF($C$8=\"Central\",VLOOKUP($B37,Central,15,FALSE), IF($C$8=\"East_Central\",VLOOKUP($B37,East_Central,15,FALSE), IF($C$8=\"Southwest\",VLOOKUP($B37,Southwest,15,FALSE), IF($C$8=\"South_Central\",VLOOKUP($B37,South_Central,15,FALSE),IF($C$8=\"Southeast\",VLOOKUP($B37,Southeast,15,FALSE)))))))))))","v":""},{"$f":"IF($B37=\"\",\"\",IF($C$8=\"Northwest\",VLOOKUP($B37,Northwest,16,FALSE),IF($C$8=\"North_Central\",VLOOKUP($B37,North_Central,16,FALSE),IF($C$8=\"Northeast\",VLOOKUP($B37,Northeast,16,FALSE),IF($C$8=\"West_Central\",VLOOKUP($B37,West_Central,16,FALSE),IF($C$8=\"Central\",VLOOKUP($B37,Central,16,FALSE), IF($C$8=\"East_Central\",VLOOKUP($B37,East_Central,16,FALSE), IF($C$8=\"Southwest\",VLOOKUP($B37,Southwest,16,FALSE), IF($C$8=\"South_Central\",VLOOKUP($B37,South_Central,16,FALSE),IF($C$8=\"Southeast\",VLOOKUP($B37,Southeast,16,FALSE)))))))))))","v":""},"","","","","","","","","","","","","","","","","",null,null,null,null,null,null,null,null,null,null,null,null,null,null,null,null,null,null,null,null,null,null,null,null,null,null,null,null,null,null,null,null,null,null,null,null,null,null,null,null,"MADISON","South_Central"]
[null,"","","","","","","","","","","","","","","","","","","","","","","","","","","","","","","","","",null,null,null,null,null,null,null,null,null,null,null,null,null,null,null,null,null,null,null,null,null,null,null,null,null,null,null,null,null,null,null,null,null,null,null,null,null,null,null,null,"MAHASKA","Southeast"]
[null,"","","","","","","","","","","","","","","","","","","","","","","","","","","","","","","","","",null,null,null,null,null,null,null,null,null,null,null,null,null,null,null,null,null,null,null,null,null,null,null,null,null,null,null,null,null,null,null,null,null,null,null,null,null,null,null,null,"MARION","South_Central"]
[null,"","","","","","","","","","","","","","","","","","","","","","","","","","","","","","","","","",null,null,null,null,null,null,null,null,null,null,null,null,null,null,null,null,null,null,null,null,null,null,null,null,null,null,null,null,null,null,null,null,null,null,null,null,null,null,null,null,"MARSHALL","Central"]
[null,"","","","","","","","","","","","","","","","","","","","","","","","","","","","","","","","","",null,null,null,null,null,null,null,null,null,null,null,null,null,null,null,null,null,null,null,null,null,null,null,null,null,null,null,null,null,null,null,null,null,null,null,null,null,null,null,null,"MILLS","Southwest"]
[null,"","","","","","","","","","","","","","","","","","","","","","","","","","","","","","","","","",null,null,null,null,null,null,null,null,null,null,null,null,null,null,null,null,null,null,null,null,null,null,null,null,null,null,null,null,null,null,null,null,null,null,null,null,null,null,null,null,"MITCHELL","North_Central"]
[null,"","","","","","","","","","","","","","","","","","","","","","","","","","","","","","","","","",null,null,null,null,null,null,null,null,null,null,null,null,null,null,null,null,null,null,null,null,null,null,null,null,null,null,null,null,null,null,null,null,null,null,null,null,null,null,null,null,"MONONA","West_Central"]
[null,"","","","","","","","","","","","","","","","","","","","","","","","","","","","","","","","","",null,null,null,null,null,null,null,null,null,null,null,null,null,null,null,null,null,null,null,null,null,null,null,null,null,null,null,null,null,null,null,null,null,null,null,null,null,null,null,null,"MONROE","South_Central"]
[null,"","","","","","","","","","","","","","","","","","","","","","","","","","","","","","","","","",null,null,null,null,null,null,null,null,null,null,null,null,null,null,null,null,null,null,null,null,null,null,null,null,null,null,null,null,null,null,null,null,null,null,null,null,null,null,null,null,"MONTGOMERY","Southwest"]
[null,"","","","","","","","","","","","","","","","","","","","","","","","","","","","","","","","","",null,null,null,null,null,null,null,null,null,null,null,null,null,null,null,null,null,null,null,null,null,null,null,null,null,null,null,null,null,null,null,null,null,null,null,null,null,null,null,null,"MUSCATINE","East_Central"]
[null,"","","","","","","","","","","","","","","","","","","","","","","","","","","","","","","","","",null,null,null,null,null,null,null,null,null,null,null,null,null,null,null,null,null,null,null,null,null,null,null,null,null,null,null,null,null,null,null,null,null,null,null,null,null,null,null,null,"OBRIEN","Northwest"]
[null,"","","","","","","","","","","","","","","","","","","","","","","","","","","","","","","","","",null,null,null,null,null,null,null,null,null,null,null,null,null,null,null,null,null,null,null,null,null,null,null,null,null,null,null,null,null,null,null,null,null,null,null,null,null,null,null,null,"OSCEOLA","Northwest"]
[null,"","","","","","","","","","","","","","","","","","","","","","","","","","","","","","","","","",null,null,null,null,null,null,null,null,null,null,null,null,null,null,null,null,null,null,null,null,null,null,null,null,null,null,null,null,null,null,null,null,null,null,null,null,null,null,null,null,"PAGE","Southwest"]
[null,"","","","","","","","","","","","","","","","","","","","","","","","","","","","","","","","","",null,null,null,null,null,null,null,null,null,null,null,null,null,null,null,null,null,null,null,null,null,null,null,null,null,null,null,null,null,null,null,null,null,null,null,null,null,null,null,null,"PALO ALTO","Northwest"]
[null,"","","","","","","","","","","","","","","","","","","","","","","","","","","","","","","","","",null,null,null,null,null,null,null,null,null,null,null,null,null,null,null,null,null,null,null,null,null,null,null,null,null,null,null,null,null,null,null,null,null,null,null,null,null,null,null,null,"PLYMOUTH","Northwest"]
[null,"","","","","","","","","","","","","","","","","","","","","","","","","","","","","","","","","",null,null,null,null,null,null,null,null,null,null,null,null,null,null,null,null,null,null,null,null,null,null,null,null,null,null,null,null,null,null,null,null,null,null,null,null,null,null,null,null,"POCAHONTAS","Northwest"]
[null,"","","","","","","","","","","","","","","","","","","","","","","","","","","","","","","","","",null,null,null,null,null,null,null,null,null,null,null,null,null,null,null,null,null,null,null,null,null,null,null,null,null,null,null,null,null,null,null,null,null,null,null,null,null,null,null,null,"POLK","Central"]
[null,"","","","","","","","","","","","","","","","","","","","","","","","","","","","","","","","","",null,null,null,null,null,null,null,null,null,null,null,null,null,null,null,null,null,null,null,null,null,null,null,null,null,null,null,null,null,null,null,null,null,null,null,null,null,null,null,null,"POTTAWATTAMIE","Southwest"]
[null,"","","","","","","","","","","","","","","","","","","","","","","","","","","","","","","","","",null,null,null,null,null,null,null,null,null,null,null,null,null,null,null,null,null,null,null,null,null,null,null,null,null,null,null,null,null,null,null,null,null,null,null,null,null,null,null,null,"POWESHIEK","Central"]
[null,{"$f":"IF(B57=\"\",\"\",B57)","v":""},{"$f":"IF(B57=\"\",\"\",\"See Seeding Dates Entered Above\")","v":""},null,null,null,null,null,null,null,null,null,null,null,null,null,null,null,null,null,null,null,null,null,null,null,null,null,null,null,null,null,null,null,null,null,null,null,null,null,null,null,null,null,null,null,null,null,null,null,null,null,null,null,null,null,null,null,null,null,null,null,null,null,null,null,null,null,null,null,null,null,null,null,"RINGGOLD","South_Central"]
[null,{"$f":"IF(B58=\"\",\"\",B58)","v":""},{"$f":"IF(B58=\"\",\"\",\"See Seeding Dates Entered Above\")","v":""},null,null,null,null,null,null,null,null,null,null,null,null,null,null,null,null,null,null,null,null,null,null,null,null,null,null,null,null,null,null,null,null,null,null,null,null,null,null,null,null,null,null,null,null,null,null,null,null,null,null,null,null,null,null,null,null,null,null,null,null,null,null,null,null,null,null,null,null,null,null,null,"SAC","West_Central"]
[null,"","",null,null,null,null,null,null,null,null,null,null,null,null,null,null,null,null,null,null,null,null,null,null,null,null,null,null,null,null,null,null,null,null,null,null,null,null,null,null,null,null,null,null,null,null,null,null,null,null,null,null,null,null,null,null,null,null,null,null,null,null,null,null,null,null,null,null,null,null,null,null,null,"SCOTT","East_Central"]
[null,"","",null,null,null,null,null,null,null,null,null,null,null,null,null,null,null,null,null,null,null,null,null,null,null,null,null,null,null,null,null,null,null,null,null,null,null,null,null,null,null,null,null,null,null,null,null,null,null,null,null,null,null,null,null,null,null,null,null,null,null,null,null,null,null,null,null,null,null,null,null,null,null,"SHELBY","West_Central"]
[null,null,null,null,null,null,null,null,null,null,null,null,null,null,null,null,null,null,null,null,null,null,null,null,null,null,null,null,null,null,null,null,null,null,null,null,null,null,null,null,null,null,null,null,null,null,null,null,null,null,null,null,null,null,null,null,null,null,null,null,null,null,null,null,null,null,null,null,null,null,null,null,null,null,"SIOUX","Northwest"]
[null,"Date Table",null,null,null,null,null,null,null,null,null,null,null,null,null,null,null,null,null,null,null,null,null,null,null,null,null,null,null,null,null,null,null,null,null,null,null,null,null,null,null,null,null,null,null,null,null,null,null,null,null,null,null,null,null,null,null,null,null,null,null,null,null,null,null,null,null,null,null,null,null,null,null,null,"STORY","Central"]
[null,{"$f":"IF($BD$21=3,\"\",\"First date to seed for selected timeframe:\")","v":"First date to seed for selected timeframe:"},null,null,null,null,null,null,null,null,null,null,{"$f":"IF($BD$21=3,\"\",IF(AA33=\"Fall\",Lists!P156,Lists!L157))","v":"00:00:00"},null,null,null,null,null,null,null,null,null,null,null,"A late seeding variance for winter cereal rye, winter triticale, and camelina allows these species to be seeded prior to December 21 with additional considerations.  See 340_IA_GD_Cover_Crop_2024.pdf for more detail.",null,null,null,null,null,null,null,null,null,null,null,null,null,null,null,null,null,null,null,null,null,null,null,null,null,null,null,null,null,null,null,null,null,null,null,null,null,null,null,null,null,null,null,null,null,null,null,null,null,"TAMA","Central"]
[null,{"$f":"IF($BD$21=3,\"For interseeding seed prior to V7 corn growth stage.\",\"Preferred seeding date range:\")","v":"Preferred seeding date range:"},null,null,null,null,null,null,null,null,null,null,{"$f":"IF($BD$21=3,\"\",IF(AA33=\"Fall\", Lists!Q156,Lists!M157))","v":"00:00:00"},null,null,null,null,null,{"$f":"IF($BD$21=3,\"\",IF(AA33=\"Fall\",Lists!R156,Lists!N157))","v":"00:00:00"},null,null,null,null,null,null,null,null,null,null,null,null,null,null,null,null,null,null,null,null,null,null,null,null,null,null,null,null,null,null,null,null,null,null,null,null,null,null,null,null,null,null,null,null,null,null,null,null,null,null,null,null,null,null,null,"TAYLOR","Southwest"]
[null,{"$f":"IF($BD$21=3,\"\",\"Last date to seed for selected planting timeframe:\")","v":"Last date to seed for selected planting timeframe:"},null,null,null,null,null,null,null,null,null,null,{"$f":"IF($BD$21=3,\"\",IF($AA$33=\"Fall\",Lists!S156,Lists!O157))","v":"00:00:00"},null,null,null,null,null,null,null,null,null,null,null,null,null,null,null,null,null,null,null,null,null,null,null,null,null,null,null,null,null,null,null,null,null,null,null,null,null,null,null,null,null,null,null,null,null,null,null,null,null,null,null,null,null,null,null,null,null,null,null,null,null,"UNION","South_Central"]
[null,"Notes:",null,null,null,null,null,null,null,null,null,null,null,null,null,null,null,null,null,null,null,null,null,null,null,null,null,null,null,null,null,null,null,null,null,null,null,null,null,null,null,null,null,null,null,null,null,null,null,null,null,null,null,null,null,null,null,null,null,null,null,null,null,null,null,null,null,null,null,null,null,null,null,null,"VAN BUREN","Southeast"]
[null,null,null,null,null,null,null,null,null,null,null,null,null,null,null,null,null,null,null,null,null,null,null,null,null,null,null,null,null,null,null,null,null,null,null,null,null,null,null,null,null,null,null,null,null,null,null,null,null,null,null,null,null,null,null,null,null,null,null,null,null,null,null,null,null,null,null,null,null,null,null,null,null,null,"WAPELLO","Southeast"]
[null,null,null,null,null,null,null,null,null,null,null,null,null,null,null,null,null,null,null,null,null,null,null,null,null,null,null,null,null,null,null,null,null,null,null,null,null,null,null,null,null,null,null,null,null,null,null,null,null,null,null,null,null,null,null,null,null,null,null,null,null,null,null,null,null,null,null,null,null,null,null,null,null,null,"WARREN","South_Central"]
[null,null,null,null,null,null,null,null,null,null,null,null,null,null,null,null,null,null,null,null,null,null,null,null,null,null,null,null,null,null,null,null,null,null,null,null,null,null,null,null,null,null,null,null,null,null,null,null,null,null,null,null,null,null,null,null,null,null,null,null,null,null,null,null,null,null,null,null,null,null,null,null,null,null,"WASHINGTON","Southeast"]
[null,null,null,null,null,null,null,null,null,null,null,null,null,null,null,null,null,null,null,null,null,null,null,null,null,null,null,null,null,null,null,null,null,null,null,null,null,null,null,null,null,null,null,null,null,null,null,null,null,null,null,null,null,null,null,null,null,null,null,null,null,null,null,null,null,null,null,null,null,null,null,null,null,null,"WAYNE","South_Central"]
[null,null,null,null,null,null,null,null,null,null,null,null,null,null,null,null,null,null,null,null,null,null,null,null,null,null,null,null,null,null,null,null,null,null,null,null,null,null,null,null,null,null,null,null,null,null,null,null,null,null,null,null,null,null,null,null,null,null,null,null,null,null,null,null,null,null,null,null,null,null,null,null,null,null,"WEBSTER","Central"]
[null,null,null,null,null,null,null,null,null,null,null,null,null,null,null,null,null,null,null,null,null,null,null,null,null,null,null,null,null,null,null,null,null,null,null,null,null,null,null,null,null,null,null,null,null,null,null,null,null,null,null,null,null,null,null,null,null,null,null,null,"None",null,null,null,null,null,null,null,null,null,null,null,null,null,"WINNEBAGO","North_Central"]
[null,"Practice Specifications Approval and Completion Certification:",null,null,null,null,null,null,null,null,null,null,null,null,null,null,null,null,null,null,null,null,null,null,null,null,null,null,null,null,null,null,null,null,null,null,null,null,null,null,null,null,null,null,null,null,null,null,null,null,null,null,null,null,null,null,null,null,"Job Approval ",null,"I",null,null,null,null,null,null,null,null,null,null,null,null,null,"WINNESHIEK","Northeast"]
[null,"Design, Installation, and Layout Approval:",null,null,null,null,null,null,null,null,null,null,null,null,null,null,null,null,null,null,null,null,null,null,null,null,null,null,null,null,null,null,null,null,null,null,null,null,null,null,null,null,null,null,null,null,null,null,null,null,null,null,null,null,null,null,null,null,null,null,"II",null,null,null,null,null,null,null,null,null,null,null,null,null,"WOODBURY","West_Central"]
[null,"Designed by:",null,null,null,null,null,null,null,null,null,null,null,null,null,null,null,null,"Date:",null,null,null,null,null,"Job Approval Authority (JAA):",null,null,null,null,null,null,null,null,null,null,null,null,null,null,null,null,null,null,null,null,null,null,null,null,null,null,null,null,null,null,null,null,null,null,null,"III",null,null,null,null,null,null,null,null,null,null,null,null,null,"WORTH","North_Central"]
[null,"Approved by:\n",null,null,null,null,null,null,null,null,null,null,null,null,null,null,null,null,"Date:",null,null,null,null,null,"Job Approval Authority (JAA):",null,null,null,null,null,null,null,null,null,null,null,null,null,null,null,null,null,null,null,null,null,null,null,null,null,null,null,null,null,null,null,null,null,null,null,"IV",null,null,null,null,null,null,null,null,null,null,null,null,null,"WRIGHT","North_Central"]
[null,null,null,null,"Approved by signature only required if Planner does not have proper JAA or for ARC approval of non-listed species.",null,null,null,null,null,null,null,null,null,null,null,null,null,null,null,null,null,null,null,null,null,null,null,null,null,null,null,null,null,null,null,null,null,null,null,null,null,null,null,null,null,null,null,null,null,null,null,null,null,null,null,null,null,null,null,"V"]
[null,null,null,null,"Landowner/Operator Acknowledges:"]
[null,null,null,null,"a.  I have received a copy of the specifications and understand the contents, including the scope and\n      location of the practice.\nb.  I have obtained all necessary permits and/or rights in advance of practice application, and will comply\n      with all ordinances and laws pertaining to the application of this practice.\nc.  No changes will be made in the installation of the job without prior concurrence of the NRCS.\nd.  Maintenance of the installed work is necessary for proper performance during the life of the practice. \n     The practice life is 1 year. Program requirements may require longer maintenance, check the \n     program contract."]
[]
[]
[]
[null,null,null,null,{"$f":"IF(BD21=2,Statements!B2,\"\")","v":""}]
[null,null,null,null,"I have reviewed all specifications and agree to install as specified:"]
[null,"Landowner/Operator Signature:",null,null,null,null,null,null,null,null,null,null,null,null,null,null,null,null,null,null,null,null,null,null,"Date:"]
[]
[null,"ANNUAL CERTIFICATION",null,null,"I certify implementation of this conservation practice is complete, meets criteria for the stated purpose(s) and meets the NRCS conservation practice standard and specifications. Document which year/CIN is being certified in Notes."]
[null,"Approved by:",null,null,null,null,null,null,null,null,null,null,null,null,null,null,"Date:",null,null,null,null,null,"Job Approval Authority (JAA):"]
[null,null,"Notes:",null,null,null,null,null,null,null,null,null,null,null,null,null,null,null,null,null,null,null,"CIN:"]
[null,"Approved by:",null,null,null,null,null,null,null,null,null,null,null,null,null,null,"Date:",null,null,null,null,null,"Job Approval Authority (JAA):"]
[null,null,"Notes:",null,null,null,null,null,null,null,null,null,null,null,null,null,null,null,null,null,null,null,"CIN:"]
[null,"Approved by:",null,null,null,null,null,null,null,null,null,null,null,null,null,null,"Date:",null,null,null,null,null,"Job Approval Authority (JAA):"]
[null,null,"Notes:",null,null,null,null,null,null,null,null,null,null,null,null,null,null,null,null,null,null,null,"CIN:"]
[null,"Approved by:",null,null,null,null,null,null,null,null,null,null,null,null,null,null,"Date:",null,null,null,null,null,"Job Approval Authority (JAA):"]
[null,null,"Notes:",null,null,null,null,null,null,null,null,null,null,null,null,null,null,null,null,null,null,null,"CIN:"]
[null,"Approved by:",null,null,null,null,null,null,null,null,null,null,null,null,null,null,"Date:",null,null,null,null,null,"Job Approval Authority (JAA):"]
[null,null,"Notes:",null,null,null,null,null,null,null,null,null,null,null,null,null,null,null,null,null,null,null,"CIN:"]
[]
[null,"OPERATION AND MAINTENANCE:"]
[null,"Evaluate the cover crop to determine if the cover crop is meeting the planned purpose(s). If the cover crop is not meeting the purpose(s) adjust the management, change the species of cover crop, or choose a different technology."]

{"sheet":"Crop Districts","index":2,"n_rows":327,"n_cols":34,"rows_kept":327,"cut":false,"hidden":false,"merged":[[0,35,0,49],[1,35,1,49],[13,2,13,33],[14,2,14,3],[14,4,14,7],[14,8,14,11],[14,12,14,15],[14,16,14,19],[14,20,14,23],[14,24,14,27],[14,28,14,31],[14,32,14,33],[0,1,0,33],[1,2,1,19],[48,2,48,33],[49,2,49,3],[49,4,49,7],[49,8,49,11],[49,12,49,15],[49,16,49,19],[49,20,49,23],[49,24,49,27],[49,28,49,31],[49,32,49,33],[83,2,83,33],[84,2,84,3],[84,4,84,7],[84,8,84,11],[84,12,84,15],[84,16,84,19],[84,20,84,23],[84,24,84,27],[84,28,84,31],[84,32,84,33],[188,2,188,33],[118,2,118,33],[119,2,119,3],[119,4,119,7],[119,8,119,11],[119,12,119,15],[119,16,119,19],[119,20,119,23],[119,24,119,27],[119,28,119,31],[119,32,119,33],[153,2,153,33],[154,2,154,3],[154,4,154,7],[154,8,154,11],[154,12,154,15],[154,16,154,19],[154,20,154,23],[154,24,154,27],[154,28,154,31],[154,32,154,33],[189,32,189,33],[223,2,223,33],[189,2,189,3],[189,4,189,7],[189,8,189,11],[189,12,189,15],[189,16,189,19],[294,20,294,23],[294,24,294,27],[294,28,294,31],[189,20,189,23],[189,24,189,27],[189,28,189,31],[224,2,224,3],[224,4,224,7],[224,8,224,11],[224,12,224,15],[293,2,293,33],[224,16,224,19],[224,20,224,23],[224,24,224,27],[224,28,224,31],[224,32,224,33],[294,32,294,33],[258,2,258,33],[259,2,259,3],[259,4,259,7],[259,8,259,11],[259,12,259,15],[259,16,259,19],[259,20,259,23],[259,24,259,27],[259,28,259,31],[259,32,259,33],[294,2,294,3],[294,4,294,7],[294,8,294,11],[294,12,294,15],[294,16,294,19]]}
[null," Cover Crop Seeding Dates by Crop District"]
[null,null,"Click the button for your Zone to show the seeding dates."]
[]
[null,null," "]
[]
[]
[]
[]
[]
[]
[]
[]
[]
[null,"Species","Northwest"]
[null,null,"March",null,"April",null,null,null,"May",null,null,null,"June",null,null,null,"July",null,null,null,"August",null,null,null,"September",null,null,null,"October",null,null,null,"November"]
[null,"Barley, Spring",{"$f":"Lists!$B$16","v":"2021-03-23"},"-",{"$f":"+Lists!$C$16","v":"2021-04-07"},"-","-","-",{"$f":"+Lists!$D$16","v":"2021-05-04"},"-","-",{"$f":"+Lists!$E$16","v":"2021-05-29"},null,null,null,null,null,null,null,null,{"$f":"+Lists!$F$16","v":"2021-08-06"},"-",{"$f":"+Lists!$G$16","v":"2021-08-18"},"-",{"$f":"+Lists!$H$16","v":"2021-09-06"},"-",{"$f":"+Lists!$I$16","v":"2021-09-18"}]
[null,"Barley, Winter",null,null,null,null,null,null,null,null,null,null,null,null,null,null,null,null,null,null,{"$f":"Lists!F17","v":"2021-08-06"},"-",{"$f":"Lists!G17","v":"2021-08-18"},"-",{"$f":"Lists!H17","v":"2021-09-06"},"-",{"$f":"Lists!I17","v":"2021-09-18"}]
[null,"Mungbeans",null,null,null,null,null,null,null,{"$f":"Lists!C18","v":"2021-05-17"},"-","-","-","-","-","-","-","-","-","-",{"$f":"Lists!D18","v":"2021-08-05"}]
[null,"Buckwheat",null,null,null,null,null,null,null,{"$f":"Lists!C19","v":"2021-05-17"},"-","-","-","-","-","-","-","-","-","-","-","-","-","-",{"$f":"Lists!H19","v":"2021-09-06"}]
[null,"Camelina, Winter",null,null,null,null,null,null,null,null,null,null,null,null,null,null,null,null,null,null,{"$f":"Lists!F20","v":"2021-08-06"},"-",{"$f":"Lists!G20","v":"2021-08-18"},"-","-","-","-","-","-",{"$f":"Lists!H20","v":"2021-10-17"},"-",{"$f":"Lists!I20","v":"2021-10-31"}]
[null,"Clover, Berseem",null,null,{"$f":"Lists!B21","v":"2021-04-07"},"-",{"$f":"Lists!C21","v":"2021-04-18"},"-","-","-",{"$f":"Lists!D21","v":"2021-05-23"},null,null,null,null,null,null,null,null,null,{"$f":"Lists!G21","v":"2021-08-06"},"-","-",{"$f":"Lists!H21","v":"2021-08-24"},{"$f":"Lists!I21","v":"2021-09-06"}]
[null,"Clover, Crimson",null,null,{"$f":"Lists!B22","v":"2021-04-07"},"-",{"$f":"Lists!C22","v":"2021-04-18"},"-","-","-",{"$f":"Lists!D22","v":"2021-05-23"},null,null,null,null,null,null,null,null,null,{"$f":"Lists!G22","v":"2021-08-06"},"-","-",{"$f":"Lists!H22","v":"2021-08-24"},{"$f":"Lists!I22","v":"2021-09-06"}]
[null,"Clover, Red",{"$f":"Lists!B23","v":"2021-03-23"},"-",{"$f":"Lists!C23","v":"2021-04-07"},"-","-","-","-","-",{"$f":"Lists!D23","v":"2021-05-23"},null,null,null,null,null,null,null,null,null,{"$f":"Lists!G23","v":"2021-08-06"},"-","-","-",{"$f":"Lists!H23","v":"2021-09-06"},{"$f":"Lists!I23","v":"2021-09-12"}]
[null,"Clover, White",{"$f":"Lists!B24","v":"2021-03-23"},"-",{"$f":"Lists!C24","v":"2021-04-07"},"-","-","-","-","-",{"$f":"Lists!D24","v":"2021-05-23"},null,null,null,null,null,null,null,null,null,{"$f":"Lists!G24","v":"2021-08-06"},"-","-","-",{"$f":"Lists!H24","v":"2021-09-06"},{"$f":"Lists!I24","v":"2021-09-12"}]
[null,"Cowpea",null,null,null,null,null,null,null,{"$f":"Lists!C25","v":"2021-05-17"},"-","-","-","-","-","-","-","-","-","-",{"$f":"Lists!D25","v":"2021-08-05"}]
[null,"Flax",{"$f":"Lists!B26","v":"2021-03-23"},"-",{"$f":"Lists!C26","v":"2021-04-07"},"-","-","-","-",{"$f":"Lists!D26","v":"2021-05-17"},"-","-",{"$f":"Lists!E26","v":"2021-06-05"},null,null,null,null,null,{"$f":"Lists!F26","v":"2021-07-17"},"-",{"$f":"Lists!G26","v":"2021-08-06"},"-","-","-",{"$f":"Lists!H26","v":"2021-09-06"},"-",{"$f":"Lists!I26","v":"2021-09-18"}]
[null,"Kale",{"$f":"Lists!B27","v":"2021-03-23"},"-",{"$f":"Lists!C27","v":"2021-04-07"},"-","-","-","-",{"$f":"Lists!D27","v":"2021-05-18"},null,null,null,null,null,null,{"$f":"Lists!F27","v":"2021-07-05"},"-","-",{"$f":"Lists!G27","v":"2021-07-24"},"-","-","-","-",{"$f":"Lists!H27","v":"2021-09-06"},"-",{"$f":"Lists!I27","v":"2021-09-18"}]
[null,"Millet",null,null,null,null,null,null,null,{"$f":"Lists!C28","v":"2021-05-17"},"-","-","-","-","-","-","-","-","-","-",{"$f":"Lists!D28","v":"2021-08-05"}]
[null,"Mustard",{"$f":"Lists!B29","v":"2021-03-23"},"-",{"$f":"Lists!C29","v":"2021-04-07"},"-","-","-","-",{"$f":"Lists!D29","v":"2021-05-18"},null,null,null,null,null,null,null,null,null,null,{"$f":"Lists!G29","v":"2021-08-06"},"-","-","-",{"$f":"Lists!H29","v":"2021-09-06"},"-",{"$f":"Lists!I29","v":"2021-09-18"}]
[null,"Oats",{"$f":"Lists!B30","v":"2021-03-23"},"-",{"$f":"Lists!C30","v":"2021-04-07"},"-","-","-",{"$f":"Lists!D30","v":"2021-05-04"},"-","-","-","-","-","-","-","-","-","-","-","-","-",{"$f":"Lists!G30","v":"2021-08-18"},"-",{"$f":"Lists!H30","v":"2021-09-06"},"-",{"$f":"Lists!I30","v":"2021-09-18"}]
[null,"Pea, Field/Winter",null,null,{"$f":"Lists!C31","v":"2021-04-07"},"-","-","-","-","-",{"$f":"Lists!D31","v":"2021-05-23"},null,null,null,null,null,null,null,null,null,{"$f":"Lists!G31","v":"2021-08-06"},"-","-",{"$f":"Lists!H31","v":"2021-08-24"},{"$f":"Lists!I31","v":"2021-09-06"},"-"]
[null,"Radish",null,null,{"$f":"Lists!B32","v":"2021-04-07"},"-","-","-","-","-","-","-","-","-","-","-","-","-","-","-",{"$f":"Lists!G32","v":"2021-08-06"},"-","-","-",{"$f":"Lists!H32","v":"2021-09-06"},"-",{"$f":"Lists!I32","v":"2021-09-18"}]
[null,"Rapeseed",{"$f":"Lists!B33","v":"2021-03-23"},"-",{"$f":"Lists!C33","v":"2021-04-07"},"-","-","-","-",{"$f":"Lists!D33","v":"2021-05-17"},"-","-","-","-","-","-","-","-","-","-",{"$f":"Lists!G33","v":"2021-08-06"},"-","-","-",{"$f":"Lists!H33","v":"2021-09-06"},"-",{"$f":"Lists!I33","v":"2021-09-18"}]
[null,"Rye, Winter/Cereal",null,null,null,null,null,null,null,null,null,null,null,null,null,null,null,null,null,null,{"$f":"Lists!F34","v":"2021-08-06"},"-",{"$f":"Lists!G34","v":"2021-08-18"},"-","-","-","-","-","-",{"$f":"Lists!H34","v":"2021-10-17"},"-",{"$f":"Lists!I34","v":"2021-10-31"}]
[null,"Ryegrass, Annual",null,null,{"$f":"Lists!C35","v":"2021-04-07"},"-","-","-","-",{"$f":"Lists!D35","v":"2021-05-17"},"-","-","-","-",{"$f":"Lists!E35","v":"2021-06-17"},null,null,null,{"$f":"Lists!G35","v":"2021-07-17"},"-","-","-",{"$f":"Lists!H35","v":"2021-08-17"},"-","-","-",{"$f":"Lists!I35","v":"2021-09-18"}]
[null,"Sorghum, Forage",null,null,null,null,null,null,null,{"$f":"Lists!C36","v":"2021-05-17"},"-","-","-","-","-","-","-","-","-","-",{"$f":"Lists!D36","v":"2021-08-05"}]
[null,"Sorghum-Sudangrass",null,null,null,null,null,null,null,{"$f":"Lists!C37","v":"2021-05-17"},"-","-","-","-","-","-","-","-","-","-",{"$f":"Lists!D37","v":"2021-08-05"}]
[null,"Sudangrass",null,null,null,null,null,null,null,{"$f":"Lists!C38","v":"2021-05-17"},"-","-","-","-","-","-","-","-","-","-",{"$f":"Lists!D38","v":"2021-08-05"}]
[null,"Sunflower",null,null,null,null,null,null,{"$f":"Lists!C39","v":"2021-05-04"},"-","-","-","-","-","-","-","-","-","-","-",{"$f":"Lists!D39","v":"2021-08-05"},"-","-",{"$f":"Lists!E39","v":"2021-08-24"}]
[null,"Sunn Hemp",null,null,null,null,null,null,null,{"$f":"Lists!C40","v":"2021-05-17"},"-","-","-","-","-","-","-","-","-","-",{"$f":"Lists!D40","v":"2021-08-05"},"-","-",{"$f":"Lists!E40","v":"2021-08-24"}]
[null,"Teff",null,null,null,null,null,null,null,{"$f":"Lists!C41","v":"2021-05-17"},"-","-","-","-","-","-","-","-","-","-",{"$f":"Lists!D41","v":"2021-08-05"},"-","-",{"$f":"Lists!E41","v":"2021-08-24"}]
[null,"Triticale, Winter",null,null,null,null,null,null,null,null,null,null,null,null,null,null,null,null,null,null,{"$f":"Lists!F42","v":"2021-08-06"},"-",{"$f":"Lists!G42","v":"2021-08-18"},"-","-","-","-","-","-",{"$f":"Lists!H42","v":"2021-10-17"},"-",{"$f":"Lists!I42","v":"2021-10-31"}]
[null,"Turnip",null,null,{"$f":"Lists!B43","v":"2021-04-07"},"-","-","-","-","-","-","-","-","-","-","-","-","-","-","-",{"$f":"Lists!G43","v":"2021-08-06"},"-","-","-",{"$f":"Lists!H43","v":"2021-09-06"},"-",{"$f":"Lists!I43","v":"2021-09-18"}]
[null,"Vetch, Common",null,null,{"$f":"Lists!C44","v":"2021-04-07"},"-","-","-","-","-",{"$f":"Lists!D44","v":"2021-05-23"},null,null,null,null,null,null,null,null,{"$f":"Lists!G44","v":"2021-07-24"},"-","-","-",{"$f":"Lists!H44","v":"2021-08-24"},{"$f":"Lists!I44","v":"2021-09-06"}]
[null,"Vetch, Hairy",null,null,{"$f":"Lists!C45","v":"2021-04-07"},"-","-","-","-","-","-","-",{"$f":"Lists!D45","v":"2021-06-05"},null,null,null,null,null,null,null,{"$f":"Lists!G45","v":"2021-08-06"},"-","-","-",{"$f":"Lists!H45","v":"2021-09-06"},{"$f":"Lists!I45","v":"2021-09-12"}]
[null,"Wheat, Spring",{"$f":"Lists!B46","v":"2021-03-23"},"-",{"$f":"Lists!C46","v":"2021-04-07"},"-","-","-",{"$f":"Lists!D46","v":"2021-05-04"},"-","-",{"$f":"Lists!E46","v":"2021-05-29"},null,null,null,null,null,null,null,null,{"$f":"Lists!F46","v":"2021-08-06"},"-","2020-08-17","-",{"$f":"Lists!H46","v":"2021-09-06"},"-",{"$f":"Lists!I46","v":"2021-09-18"}]
[null,"Wheat, Winter",null,null,null,null,null,null,null,null,null,null,null,null,null,null,null,null,null,null,{"$f":"Lists!F47","v":"2021-08-06"},"-","2020-08-17","-","-","-","-","-",{"$f":"Lists!H47","v":"2021-10-02"},{"$f":"Lists!I47","v":"2021-10-16"}]
[]
[null,"Species","North Central"]
[null,null,"March",null,"April",null,null,null,"May",null,null,null,"June",null,null,null,"July",null,null,null,"August",null,null,null,"September",null,null,null,"October",null,null,null,"November"]
[null,"Barley, Spring",{"$f":"Lists!B51","v":"2021-03-19"},"-",{"$f":"Lists!C51","v":"2021-04-03"},"-","-",{"$f":"Lists!D51","v":"2021-04-30"},"-","-","-",{"$f":"Lists!E51","v":"2021-05-27"},null,null,null,null,null,null,null,null,{"$f":"Lists!F51","v":"2021-08-07"},"-",{"$f":"Lists!G51","v":"2021-08-20"},"-",{"$f":"Lists!H51","v":"2021-09-08"},"-",{"$f":"Lists!I51","v":"2021-09-22"}]
[null,"Barley, Winter",null,null,null,null,null,null,null,null,null,null,null,null,null,null,null,null,null,null,{"$f":"Lists!F52","v":"2021-08-07"},"-",{"$f":"Lists!G52","v":"2021-08-20"},"-",{"$f":"Lists!H52","v":"2021-09-08"},"-",{"$f":"Lists!I52","v":"2021-09-22"}]
[null,"Mungbeans",null,null,null,null,null,null,null,{"$f":"Lists!C53","v":"2021-05-13"},"-","-","-","-","-","-","-","-","-","-",{"$f":"Lists!D53","v":"2021-08-06"}]
[null,"Buckwheat",null,null,null,null,null,null,null,{"$f":"Lists!C54","v":"2021-05-13"},"-","-","-","-","-","-","-","-","-","-","-","-","-","-",{"$f":"Lists!H54","v":"2021-09-08"}]
[null,"Camelina, Winter",null,null,null,null,null,null,null,null,null,null,null,null,null,null,null,null,null,null,{"$f":"Lists!F55","v":"2021-08-07"},"-",{"$f":"Lists!G55","v":"2021-08-20"},"-","-","-","-","-","-","-",{"$f":"Lists!H55","v":"2021-10-20"},"-",{"$f":"Lists!I55","v":"2021-11-03"}]
[null,"Clover, Berseem",null,null,{"$f":"Lists!B56","v":"2021-04-03"},{"$f":"Lists!C56","v":"2021-04-15"},"-","-","-","-",{"$f":"Lists!D56","v":"2021-05-20"},null,null,null,null,null,null,null,null,null,{"$f":"Lists!G56","v":"2021-08-07"},"-","-",{"$f":"Lists!H56","v":"2021-08-26"},{"$f":"Lists!I56","v":"2021-09-08"}]
[null,"Clover, Crimson",null,null,{"$f":"Lists!B57","v":"2021-04-03"},{"$f":"Lists!C57","v":"2021-04-15"},"-","-","-","-",{"$f":"Lists!D57","v":"2021-05-20"},null,null,null,null,null,null,null,null,null,{"$f":"Lists!G57","v":"2021-08-07"},"-","-",{"$f":"Lists!H57","v":"2021-08-26"},{"$f":"Lists!I57","v":"2021-09-08"}]
[null,"Clover, Red",{"$f":"Lists!B58","v":"2021-03-20"},"-",{"$f":"Lists!C58","v":"2021-04-03"},"-","-","-","-","-",{"$f":"Lists!D58","v":"2021-05-20"},null,null,null,null,null,null,null,null,null,{"$f":"Lists!G58","v":"2021-08-07"},"-","-","-",{"$f":"Lists!H58","v":"2021-09-08"},{"$f":"Lists!I58","v":"2021-09-15"}]
[null,"Clover, White",{"$f":"Lists!B59","v":"2021-03-20"},"-",{"$f":"Lists!C59","v":"2021-04-03"},"-","-","-","-","-",{"$f":"Lists!D59","v":"2021-05-20"},null,null,null,null,null,null,null,null,null,{"$f":"Lists!G59","v":"2021-08-07"},"-","-","-",{"$f":"Lists!H59","v":"2021-09-08"},{"$f":"Lists!I59","v":"2021-09-15"}]
[null,"Cowpea",null,null,null,null,null,null,null,{"$f":"Lists!C60","v":"2021-05-13"},"-","-","-","-","-","-","-","-","-","-",{"$f":"Lists!D60","v":"2021-08-06"}]
[null,"Flax",{"$f":"Lists!B61","v":"2021-03-20"},"-",{"$f":"Lists!C61","v":"2021-04-03"},"-","-","-","-",{"$f":"Lists!D61","v":"2021-05-13"},"-","-",{"$f":"Lists!E61","v":"2021-06-02"},null,null,null,null,null,{"$f":"Lists!F61","v":"2021-07-17"},"-",{"$f":"Lists!G61","v":"2021-08-07"},"-","-","-",{"$f":"Lists!H61","v":"2021-09-08"},"-",{"$f":"Lists!I61","v":"2021-09-22"}]
[null,"Kale",{"$f":"Lists!B62","v":"2021-03-20"},"-",{"$f":"Lists!C62","v":"2021-04-03"},"-","-","-","-",{"$f":"Lists!D62","v":"2021-05-15"},null,null,null,null,null,null,{"$f":"Lists!F62","v":"2021-07-04"},"-","-",{"$f":"Lists!G62","v":"2021-07-24"},"-","-","-","-",{"$f":"Lists!H62","v":"2021-09-08"},"-",{"$f":"Lists!I62","v":"2021-09-22"}]
[null,"Millet",null,null,null,null,null,null,null,{"$f":"Lists!C63","v":"2021-05-13"},"-","-","-","-","-","-","-","-","-","-",{"$f":"Lists!D63","v":"2021-08-06"}]
[null,"Mustard",{"$f":"Lists!B64","v":"2021-03-20"},"-",{"$f":"Lists!C64","v":"2021-04-03"},"-","-","-","-",{"$f":"Lists!D64","v":"2021-05-15"},null,null,null,null,null,null,null,null,null,null,{"$f":"Lists!G64","v":"2021-08-07"},"-","-","-",{"$f":"Lists!H64","v":"2021-09-08"},"-",{"$f":"Lists!I64","v":"2021-09-22"}]
[null,"Oats",{"$f":"Lists!B65","v":"2021-03-19"},"-",{"$f":"Lists!C65","v":"2021-04-03"},"-","-",{"$f":"Lists!D65","v":"2021-04-30"},"-","-","-","-","-","-","-","-","-","-","-","-","-","-",{"$f":"Lists!G65","v":"2021-08-20"},"-",{"$f":"Lists!H65","v":"2021-09-08"},"-",{"$f":"Lists!I65","v":"2021-09-22"}]
[null,"Pea, Field/Winter",null,null,{"$f":"Lists!C66","v":"2021-04-03"},"-","-","-","-","-",{"$f":"Lists!D66","v":"2021-05-20"},null,null,null,null,null,null,null,null,null,{"$f":"Lists!G66","v":"2021-08-07"},"-","-",{"$f":"Lists!H66","v":"2021-08-26"},{"$f":"Lists!I66","v":"2021-09-08"}]
[null,"Radish",null,null,{"$f":"Lists!B67","v":"2021-04-03"},"-","-","-","-","-","-","-","-","-","-","-","-","-","-","-",{"$f":"Lists!G67","v":"2021-08-07"},"-","-","-",{"$f":"Lists!H67","v":"2021-09-08"},"-",{"$f":"Lists!I67","v":"2021-09-22"}]
[null,"Rapeseed",{"$f":"Lists!B68","v":"2021-03-20"},"-",{"$f":"Lists!C68","v":"2021-04-03"},"-","-","-","-",{"$f":"Lists!D68","v":"2021-05-13"},"-","-","-","-","-","-","-","-","-","-",{"$f":"Lists!G68","v":"2021-08-07"},"-","-","-",{"$f":"Lists!H68","v":"2021-09-08"},"-",{"$f":"Lists!I68","v":"2021-09-22"}]
[null,"Rye, Winter/Cereal",null,null,null,null,null,null,null,null,null,null,null,null,null,null,null,null,null,null,{"$f":"Lists!F69","v":"2021-08-07"},"-",{"$f":"Lists!G69","v":"2021-08-20"},"-","-","-","-","-","-","-",{"$f":"Lists!H69","v":"2021-10-20"},"-",{"$f":"Lists!I69","v":"2021-11-03"}]
[null,"Ryegrass, Annual",null,null,{"$f":"Lists!C70","v":"2021-04-03"},"-","-","-","-",{"$f":"Lists!D70","v":"2021-05-13"},"-","-","-",{"$f":"Lists!E70","v":"2021-06-16"},null,null,null,null,{"$f":"Lists!G70","v":"2021-07-17"},"-","-","-",{"$f":"Lists!H70","v":"2021-08-19"},"-","-","-",{"$f":"Lists!I70","v":"2021-09-22"}]
[null,"Sorghum, Forage",null,null,null,null,null,null,null,{"$f":"Lists!C71","v":"2021-05-13"},"-","-","-","-","-","-","-","-","-","-",{"$f":"Lists!D71","v":"2021-08-06"}]
[null,"Sorghum-Sudangrass",null,null,null,null,null,null,null,{"$f":"Lists!C72","v":"2021-05-13"},"-","-","-","-","-","-","-","-","-","-",{"$f":"Lists!D72","v":"2021-08-06"}]
[null,"Sudangrass",null,null,null,null,null,null,null,{"$f":"Lists!C73","v":"2021-05-13"},"-","-","-","-","-","-","-","-","-","-",{"$f":"Lists!D73","v":"2021-08-06"}]
[null,"Sunflower",null,null,null,null,null,{"$f":"Lists!C74","v":"2021-04-30"},"-","-","-","-","-","-","-","-","-","-","-","-",{"$f":"Lists!D74","v":"2021-08-06"},"-","-",{"$f":"Lists!E74","v":"2021-08-26"}]
[null,"Sunn Hemp",null,null,null,null,null,null,null,{"$f":"Lists!C75","v":"2021-05-13"},"-","-","-","-","-","-","-","-","-","-",{"$f":"Lists!D75","v":"2021-08-06"},"-","-",{"$f":"Lists!E75","v":"2021-08-26"}]
[null,"Teff",null,null,null,null,null,null,null,{"$f":"Lists!C76","v":"2021-05-13"},"-","-","-","-","-","-","-","-","-","-",{"$f":"Lists!D76","v":"2021-08-06"},"-","-",{"$f":"Lists!E76","v":"2021-08-26"}]
[null,"Triticale, Winter",null,null,null,null,null,null,null,null,null,null,null,null,null,null,null,null,null,null,{"$f":"Lists!F77","v":"2021-08-07"},"-",{"$f":"Lists!G77","v":"2021-08-20"},"-","-","-","-","-","-","-",{"$f":"Lists!H77","v":"2021-10-20"},"-",{"$f":"Lists!I77","v":"2021-11-03"}]
[null,"Turnip",null,null,{"$f":"Lists!B78","v":"2021-04-03"},"-","-","-","-","-","-","-","-","-","-","-","-","-","-","-",{"$f":"Lists!G78","v":"2021-08-07"},"-","-","-",{"$f":"Lists!H78","v":"2021-09-08"},"-",{"$f":"Lists!I78","v":"2021-09-22"}]
[null,"Vetch, Common",null,null,{"$f":"Lists!C79","v":"2021-04-03"},"-","-","-","-","-",{"$f":"Lists!D79","v":"2021-05-20"},null,null,null,null,null,null,null,null,{"$f":"Lists!G79","v":"2021-07-24"},"-","-","-",{"$f":"Lists!H79","v":"2021-08-26"},{"$f":"Lists!I79","v":"2021-09-08"}]
[null,"Vetch, Hairy",null,null,{"$f":"Lists!C80","v":"2021-04-03"},"-","-","-","-","-","-","-",{"$f":"Lists!D80","v":"2021-06-02"},null,null,null,null,null,null,null,{"$f":"Lists!G80","v":"2021-08-07"},"-","-","-",{"$f":"Lists!H80","v":"2021-09-08"},{"$f":"Lists!I80","v":"2021-09-15"}]
[null,"Wheat, Spring",{"$f":"Lists!B81","v":"2021-03-19"},"-",{"$f":"Lists!C81","v":"2021-04-03"},"-","-",{"$f":"Lists!D81","v":"2021-04-30"},"-","-","-",{"$f":"Lists!E81","v":"2021-05-27"},null,null,null,null,null,null,null,null,{"$f":"Lists!F81","v":"2021-08-07"},"-",{"$f":"Lists!G81","v":"2021-08-20"},"-",{"$f":"Lists!H81","v":"2021-09-08"},"-",{"$f":"Lists!I81","v":"2021-09-22"}]
[null,"Wheat, Winter",null,null,null,null,null,null,null,null,null,null,null,null,null,null,null,null,null,null,{"$f":"Lists!F82","v":"2021-08-07"},"-",{"$f":"Lists!G82","v":"2021-08-20"},"-","-","-","-","-",{"$f":"Lists!H82","v":"2021-10-06"},"-",{"$f":"Lists!I82","v":"2021-10-19"}]
[]
[null,"Species","Northeast"]
[null,null,"March",null,"April",null,null,null,"May",null,null,null,"June",null,null,null,"July",null,null,null,"August",null,null,null,"September",null,null,null,"October",null,null,null,"November"]
[null,"Barley, Spring",{"$f":"Lists!B86","v":"2021-03-19"},"-",{"$f":"Lists!C86","v":"2021-04-03"},"-","-","-",{"$f":"Lists!D86","v":"2021-05-02"},"-","-",{"$f":"Lists!E86","v":"2021-05-29"},null,null,null,null,null,null,null,null,{"$f":"Lists!F86","v":"2021-08-08"},"-",{"$f":"Lists!G86","v":"2021-08-21"},"-",{"$f":"Lists!H86","v":"2021-09-09"},"-",{"$f":"Lists!I86","v":"2021-09-23"}]
[null,"Barley, Winter",null,null,null,null,null,null,null,null,null,null,null,null,null,null,null,null,null,null,{"$f":"Lists!F87","v":"2021-08-08"},"-",{"$f":"Lists!G87","v":"2021-08-21"},"-",{"$f":"Lists!H87","v":"2021-09-09"},"-",{"$f":"Lists!I87","v":"2021-09-23"}]
[null,"Mungbeans",null,null,null,null,null,null,null,{"$f":"Lists!C88","v":"2021-05-15"},"-","-","-","-","-","-","-","-","-","-",{"$f":"Lists!D88","v":"2021-08-07"}]
[null,"Buckwheat",null,null,null,null,null,null,null,{"$f":"Lists!C89","v":"2021-05-15"},"-","-","-","-","-","-","-","-","-","-","-","-","-","-",{"$f":"Lists!H89","v":"2021-09-09"}]
[null,"Camelina, Winter",null,null,null,null,null,null,null,null,null,null,null,null,null,null,null,null,null,null,{"$f":"Lists!F90","v":"2021-08-08"},"-",{"$f":"Lists!G90","v":"2021-08-21"},"-","-","-","-","-","-","-",{"$f":"Lists!H90","v":"2021-10-20"},"-",{"$f":"Lists!I90","v":"2021-11-01"}]
[null,"Clover, Berseem",null,null,{"$f":"Lists!B91","v":"2021-04-03"},{"$f":"Lists!C91","v":"2021-04-16"},"-","-","-","-",{"$f":"Lists!D91","v":"2021-05-22"},null,null,null,null,null,null,null,null,null,{"$f":"Lists!G91","v":"2021-08-08"},"-","-",{"$f":"Lists!H91","v":"2021-08-27"},{"$f":"Lists!I91","v":"2021-09-09"}]
[null,"Clover, Crimson",null,null,{"$f":"Lists!B92","v":"2021-04-03"},{"$f":"Lists!C92","v":"2021-04-16"},"-","-","-","-",{"$f":"Lists!D92","v":"2021-05-22"},null,null,null,null,null,null,null,null,null,{"$f":"Lists!G92","v":"2021-08-08"},"-","-",{"$f":"Lists!H92","v":"2021-08-27"},{"$f":"Lists!I92","v":"2021-09-09"}]
[null,"Clover, Red",{"$f":"Lists!B93","v":"2021-03-20"},"-",{"$f":"Lists!C93","v":"2021-04-03"},"-","-","-","-","-",{"$f":"Lists!D93","v":"2021-05-22"},null,null,null,null,null,null,null,null,null,{"$f":"Lists!G93","v":"2021-08-08"},"-","-","-",{"$f":"Lists!H93","v":"2021-09-09"},{"$f":"Lists!I93","v":"2021-09-16"}]
[null,"Clover, White",{"$f":"Lists!B94","v":"2021-03-20"},"-",{"$f":"Lists!C94","v":"2021-04-03"},"-","-","-","-","-",{"$f":"Lists!D94","v":"2021-05-22"},null,null,null,null,null,null,null,null,null,{"$f":"Lists!G94","v":"2021-08-08"},"-","-","-",{"$f":"Lists!H94","v":"2021-09-09"},{"$f":"Lists!I94","v":"2021-09-16"}]
[null,"Cowpea",null,null,null,null,null,null,null,{"$f":"Lists!C95","v":"2021-05-15"},"-","-","-","-","-","-","-","-","-","-",{"$f":"Lists!D95","v":"2021-08-07"}]
[null,"Flax",{"$f":"Lists!B96","v":"2021-03-20"},"-",{"$f":"Lists!C96","v":"2021-04-03"},"-","-","-","-",{"$f":"Lists!D96","v":"2021-05-15"},"-","-",{"$f":"Lists!E96","v":"2021-06-04"},null,null,null,null,null,{"$f":"Lists!F96","v":"2021-07-19"},"-",{"$f":"Lists!G96","v":"2021-08-08"},"-","-","-",{"$f":"Lists!H96","v":"2021-09-09"},"-",{"$f":"Lists!I96","v":"2021-09-23"}]
[null,"Kale",{"$f":"Lists!B97","v":"2021-03-20"},"-",{"$f":"Lists!C97","v":"2021-04-03"},"-","-","-","-",{"$f":"Lists!D97","v":"2021-05-17"},null,null,null,null,null,null,{"$f":"Lists!F97","v":"2021-07-06"},"-","-",{"$f":"Lists!G97","v":"2021-07-26"},"-","-","-","-",{"$f":"Lists!H97","v":"2021-09-09"},"-",{"$f":"Lists!I97","v":"2021-09-23"}]
[null,"Millet",null,null,null,null,null,null,null,{"$f":"Lists!C98","v":"2021-05-15"},"-","-","-","-","-","-","-","-","-","-",{"$f":"Lists!D98","v":"2021-08-07"}]
[null,"Mustard",{"$f":"Lists!B99","v":"2021-03-20"},"-",{"$f":"Lists!C99","v":"2021-04-03"},"-","-","-","-",{"$f":"Lists!D99","v":"2021-05-17"},null,null,null,null,null,null,null,null,null,null,{"$f":"Lists!G99","v":"2021-08-08"},"-","-","-",{"$f":"Lists!H99","v":"2021-09-09"},"-",{"$f":"Lists!I99","v":"2021-09-23"}]
[null,"Oats",{"$f":"Lists!B100","v":"2021-03-19"},"-",{"$f":"Lists!C100","v":"2021-04-03"},"-","-","-",{"$f":"Lists!D100","v":"2021-05-02"},"-","-","-","-","-","-","-","-","-","-","-","-","-",{"$f":"Lists!G100","v":"2021-08-21"},"-",{"$f":"Lists!H100","v":"2021-09-09"},"-",{"$f":"Lists!I100","v":"2021-09-23"}]
[null,"Pea, Field/Winter",null,null,{"$f":"Lists!C101","v":"2021-04-03"},"-","-","-","-","-",{"$f":"Lists!D101","v":"2021-05-22"},null,null,null,null,null,null,null,null,null,{"$f":"Lists!G101","v":"2021-08-08"},"-","-",{"$f":"Lists!H101","v":"2021-08-27"},{"$f":"Lists!I101","v":"2021-09-09"}]
[null,"Radish",null,null,{"$f":"Lists!B102","v":"2021-04-03"},"-","-","-","-","-","-","-","-","-","-","-","-","-","-","-",{"$f":"Lists!G102","v":"2021-08-08"},"-","-","-",{"$f":"Lists!H102","v":"2021-09-09"},"-",{"$f":"Lists!I102","v":"2021-09-23"}]
[null,"Rapeseed",{"$f":"Lists!B103","v":"2021-03-20"},"-",{"$f":"Lists!C103","v":"2021-04-03"},"-","-","-","-",{"$f":"Lists!D103","v":"2021-05-15"},"-","-","-","-","-","-","-","-","-","-",{"$f":"Lists!G103","v":"2021-08-08"},"-","-","-",{"$f":"Lists!H103","v":"2021-09-09"},"-",{"$f":"Lists!I103","v":"2021-09-23"}]
[null,"Rye, Winter/Cereal",null,null,null,null,null,null,null,null,null,null,null,null,null,null,null,null,null,null,{"$f":"Lists!F104","v":"2021-08-08"},"-",{"$f":"Lists!G104","v":"2021-08-21"},"-","-","-","-","-","-","-",{"$f":"Lists!H104","v":"2021-10-20"},"-",{"$f":"Lists!I104","v":"2021-11-01"}]
[null,"Ryegrass, Annual",null,null,{"$f":"Lists!C105","v":"2021-04-03"},"-","-","-","-",{"$f":"Lists!D105","v":"2021-05-15"},"-","-","-","-",{"$f":"Lists!E105","v":"2021-06-18"},null,null,null,{"$f":"Lists!G105","v":"2021-07-19"},"-","-","-",{"$f":"Lists!H105","v":"2021-08-20"},"-","-","-",{"$f":"Lists!I105","v":"2021-09-23"}]
[null,"Sorghum, Forage",null,null,null,null,null,null,null,{"$f":"Lists!C106","v":"2021-05-15"},"-","-","-","-","-","-","-","-","-","-",{"$f":"Lists!D106","v":"2021-08-07"}]
[null,"Sorghum-Sudangrass",null,null,null,null,null,null,null,{"$f":"Lists!C107","v":"2021-05-15"},"-","-","-","-","-","-","-","-","-","-",{"$f":"Lists!D107","v":"2021-08-07"}]
[null,"Sudangrass",null,null,null,null,null,null,null,{"$f":"Lists!C108","v":"2021-05-15"},"-","-","-","-","-","-","-","-","-","-",{"$f":"Lists!D108","v":"2021-08-07"}]
[null,"Sunflower",null,null,null,null,null,null,{"$f":"Lists!C109","v":"2021-05-02"},"-","-","-","-","-","-","-","-","-","-","-",{"$f":"Lists!D109","v":"2021-08-07"},"-","-",{"$f":"Lists!E109","v":"2021-08-27"}]
[null,"Sunn Hemp",null,null,null,null,null,null,null,{"$f":"Lists!C110","v":"2021-05-15"},"-","-","-","-","-","-","-","-","-","-",{"$f":"Lists!D110","v":"2021-08-07"},"-","-",{"$f":"Lists!E110","v":"2021-08-27"}]
[null,"Teff",null,null,null,null,null,null,null,{"$f":"Lists!C111","v":"2021-05-15"},"-","-","-","-","-","-","-","-","-","-",{"$f":"Lists!D111","v":"2021-08-07"},"-","-",{"$f":"Lists!E111","v":"2021-08-27"}]
[null,"Triticale, Winter",null,null,null,null,null,null,null,null,null,null,null,null,null,null,null,null,null,null,{"$f":"Lists!F112","v":"2021-08-08"},"-",{"$f":"Lists!G112","v":"2021-08-21"},"-","-","-","-","-","-","-",{"$f":"Lists!H112","v":"2021-10-20"},"-",{"$f":"Lists!I112","v":"2021-11-01"}]
[null,"Turnip",null,null,{"$f":"Lists!B113","v":"2021-04-03"},"-","-","-","-","-","-","-","-","-","-","-","-","-","-","-",{"$f":"Lists!G113","v":"2021-08-08"},"-","-","-",{"$f":"Lists!H113","v":"2021-09-09"},"-",{"$f":"Lists!I113","v":"2021-09-23"}]
[null,"Vetch, Common",null,null,{"$f":"Lists!C114","v":"2021-04-03"},"-","-","-","-","-",{"$f":"Lists!D114","v":"2021-05-22"},null,null,null,null,null,null,null,null,{"$f":"Lists!G114","v":"2021-07-26"},"-","-","-",{"$f":"Lists!H114","v":"2021-08-27"},{"$f":"Lists!I114","v":"2021-09-09"}]
[null,"Vetch, Hairy",null,null,{"$f":"Lists!C115","v":"2021-04-03"},"-","-","-","-","-","-","-",{"$f":"Lists!D115","v":"2021-06-04"},null,null,null,null,null,null,null,{"$f":"Lists!G115","v":"2021-08-08"},"-","-","-",{"$f":"Lists!H115","v":"2021-09-09"},{"$f":"Lists!I115","v":"2021-09-16"}]
[null,"Wheat, Spring",{"$f":"Lists!B116","v":"2021-03-19"},"-",{"$f":"Lists!C116","v":"2021-04-03"},"-","-","-",{"$f":"Lists!D116","v":"2021-05-02"},"-","-",{"$f":"Lists!E116","v":"2021-05-29"},null,null,null,null,null,null,null,null,{"$f":"Lists!F116","v":"2021-08-08"},"-",{"$f":"Lists!G116","v":"2021-08-21"},"-",{"$f":"Lists!H116","v":"2021-09-09"},"-",{"$f":"Lists!I116","v":"2021-09-23"}]
[null,"Wheat, Winter",null,null,null,null,null,null,null,null,null,null,null,null,null,null,null,null,null,null,{"$f":"Lists!F117","v":"2021-08-08"},"-",{"$f":"Lists!G117","v":"2021-08-21"},"-","-","-","-","-",{"$f":"Lists!H117","v":"2021-10-07"},"-",{"$f":"Lists!I117","v":"2021-10-19"}]
[]
[null,"Species","West Central"]
[null,null,"March",null,"April",null,null,null,"May",null,null,null,"June",null,null,null,"July",null,null,null,"August",null,null,null,"September",null,null,null,"October",null,null,null,"November"]
[null,"Barley, Spring",{"$f":"Lists!B121","v":"2021-03-18"},"-",{"$f":"Lists!C121","v":"2021-04-01"},"-","-",{"$f":"Lists!D121","v":"2021-04-28"},"-","-",{"$f":"Lists!E121","v":"2021-05-25"},null,null,null,null,null,null,null,null,null,{"$f":"Lists!F121","v":"2021-08-06"},"-",{"$f":"Lists!G121","v":"2021-08-20"},"-",{"$f":"Lists!H121","v":"2021-09-09"},"-",{"$f":"Lists!I121","v":"2021-09-22"}]
[null,"Barley, Winter",null,null,null,null,null,null,null,null,null,null,null,null,null,null,null,null,null,null,{"$f":"Lists!F122","v":"2021-08-06"},"-",{"$f":"Lists!G122","v":"2021-08-20"},"-",{"$f":"Lists!H122","v":"2021-09-09"},"-",{"$f":"Lists!I122","v":"2021-09-22"}]
[null,"Mungbeans",null,null,null,null,null,null,null,{"$f":"Lists!C123","v":"2021-05-12"},"-","-","-","-","-","-","-","-","-","-",{"$f":"Lists!D123","v":"2021-08-06"}]
[null,"Buckwheat",null,null,null,null,null,null,null,{"$f":"Lists!C124","v":"2021-05-12"},"-","-","-","-","-","-","-","-","-","-","-","-","-","-",{"$f":"Lists!H124","v":"2021-09-09"}]
[null,"Camelina, Winter",null,null,null,null,null,null,null,null,null,null,null,null,null,null,null,null,null,null,{"$f":"Lists!F125","v":"2021-08-06"},"-",{"$f":"Lists!G125","v":"2021-08-20"},"-","-","-","-","-","-","-",{"$f":"Lists!H125","v":"2021-10-22"},"-",{"$f":"Lists!I125","v":"2021-11-03"}]
[null,"Clover, Berseem",null,null,{"$f":"Lists!B126","v":"2021-04-01"},{"$f":"Lists!C126","v":"2021-04-14"},"-","-","-","-",{"$f":"Lists!D126","v":"2021-05-18"},null,null,null,null,null,null,null,null,null,{"$f":"Lists!G126","v":"2021-08-06"},"-","-",{"$f":"Lists!H126","v":"2021-08-26"},{"$f":"Lists!I126","v":"2021-09-09"}]
[null,"Clover, Crimson",null,null,{"$f":"Lists!B127","v":"2021-04-01"},{"$f":"Lists!C127","v":"2021-04-14"},"-","-","-","-",{"$f":"Lists!D127","v":"2021-05-18"},null,null,null,null,null,null,null,null,null,{"$f":"Lists!G127","v":"2021-08-06"},"-","-",{"$f":"Lists!H127","v":"2021-08-26"},{"$f":"Lists!I127","v":"2021-09-09"}]
[null,"Clover, Red",{"$f":"Lists!B128","v":"2021-03-18"},"-",{"$f":"Lists!C128","v":"2021-04-01"},"-","-","-","-","-",{"$f":"Lists!D128","v":"2021-05-18"},null,null,null,null,null,null,null,null,null,{"$f":"Lists!G128","v":"2021-08-06"},"-","-","-",{"$f":"Lists!H128","v":"2021-09-09"},{"$f":"Lists!I128","v":"2021-09-16"}]
[null,"Clover, White",{"$f":"Lists!B129","v":"2021-03-18"},"-",{"$f":"Lists!C129","v":"2021-04-01"},"-","-","-","-","-",{"$f":"Lists!D129","v":"2021-05-18"},null,null,null,null,null,null,null,null,null,{"$f":"Lists!G129","v":"2021-08-06"},"-","-","-",{"$f":"Lists!H129","v":"2021-09-09"},{"$f":"Lists!I129","v":"2021-09-16"}]
[null,"Cowpea",null,null,null,null,null,null,null,{"$f":"Lists!C130","v":"2021-05-12"},"-","-","-","-","-","-","-","-","-","-",{"$f":"Lists!D130","v":"2021-08-06"}]
[null,"Flax",{"$f":"Lists!B131","v":"2021-03-18"},"-",{"$f":"Lists!C131","v":"2021-04-01"},"-","-","-","-",{"$f":"Lists!D131","v":"2021-05-12"},"-","-",{"$f":"Lists!E131","v":"2021-06-01"},null,null,null,null,null,{"$f":"Lists!F131","v":"2021-07-17"},"-",{"$f":"Lists!G131","v":"2021-08-06"},"-","-","-",{"$f":"Lists!H131","v":"2021-09-09"},"-",{"$f":"Lists!I131","v":"2021-09-22"}]
[null,"Kale",{"$f":"Lists!B132","v":"2021-03-18"},"-",{"$f":"Lists!C132","v":"2021-04-01"},"-","-","-","-",{"$f":"Lists!D132","v":"2021-05-14"},null,null,null,null,null,null,{"$f":"Lists!F132","v":"2021-07-03"},"-","-",{"$f":"Lists!G132","v":"2021-07-24"},"-","-","-","-",{"$f":"Lists!H132","v":"2021-09-09"},"-",{"$f":"Lists!I132","v":"2021-09-22"}]
[null,"Millet",null,null,null,null,null,null,null,{"$f":"Lists!C133","v":"2021-05-12"},"-","-","-","-","-","-","-","-","-","-",{"$f":"Lists!D133","v":"2021-08-06"}]
[null,"Mustard",{"$f":"Lists!B134","v":"2021-03-18"},"-",{"$f":"Lists!C134","v":"2021-04-01"},"-","-","-","-",{"$f":"Lists!D134","v":"2021-05-14"},null,null,null,null,null,null,null,null,null,null,{"$f":"Lists!G134","v":"2021-08-06"},"-","-","-",{"$f":"Lists!H134","v":"2021-09-09"},"-",{"$f":"Lists!I134","v":"2021-09-22"}]
[null,"Oats",{"$f":"Lists!B135","v":"2021-03-18"},"-",{"$f":"Lists!C135","v":"2021-04-01"},"-","-",{"$f":"Lists!D135","v":"2021-04-28"},"-","-","-","-","-","-","-","-","-","-","-","-","-","-",{"$f":"Lists!G135","v":"2021-08-20"},"-",{"$f":"Lists!H135","v":"2021-09-09"},"-",{"$f":"Lists!I135","v":"2021-09-22"}]
[null,"Pea, Field/Winter",null,null,{"$f":"Lists!C136","v":"2021-04-01"},"-","-","-","-","-",{"$f":"Lists!D136","v":"2021-05-18"},null,null,null,null,null,null,null,null,null,{"$f":"Lists!G136","v":"2021-08-06"},"-","-",{"$f":"Lists!H136","v":"2021-08-26"},{"$f":"Lists!I136","v":"2021-09-09"}]
[null,"Radish",null,null,{"$f":"Lists!B137","v":"2021-04-01"},"-","-","-","-","-","-","-","-","-","-","-","-","-","-","-",{"$f":"Lists!G137","v":"2021-08-06"},"-","-","-",{"$f":"Lists!H137","v":"2021-09-09"},"-",{"$f":"Lists!I137","v":"2021-09-22"}]
[null,"Rapeseed",{"$f":"Lists!B138","v":"2021-03-18"},"-",{"$f":"Lists!C138","v":"2021-04-01"},"-","-","-","-",{"$f":"Lists!D138","v":"2021-05-12"},"-","-","-","-","-","-","-","-","-","-",{"$f":"Lists!G138","v":"2021-08-06"},"-","-","-",{"$f":"Lists!H138","v":"2021-09-09"},"-",{"$f":"Lists!I138","v":"2021-09-22"}]
[null,"Rye, Winter/Cereal",null,null,null,null,null,null,null,null,null,null,null,null,null,null,null,null,null,null,{"$f":"Lists!F139","v":"2021-08-06"},"-",{"$f":"Lists!G139","v":"2021-08-20"},"-","-","-","-","-","-","-",{"$f":"Lists!H139","v":"2021-10-22"},"-",{"$f":"Lists!I139","v":"2021-11-03"}]
[null,"Ryegrass, Annual",null,null,{"$f":"Lists!C140","v":"2021-04-01"},"-","-","-","-",{"$f":"Lists!D140","v":"2021-05-12"},"-","-","-",{"$f":"Lists!E140","v":"2021-06-15"},null,null,null,null,{"$f":"Lists!G140","v":"2021-07-17"},"-","-","-",{"$f":"Lists!H140","v":"2021-08-19"},"-","-","-",{"$f":"Lists!I140","v":"2021-09-22"}]
[null,"Sorghum, Forage",null,null,null,null,null,null,null,{"$f":"Lists!C141","v":"2021-05-12"},"-","-","-","-","-","-","-","-","-","-",{"$f":"Lists!D141","v":"2021-08-06"}]
[null,"Sorghum-Sudangrass",null,null,null,null,null,null,null,{"$f":"Lists!C142","v":"2021-05-12"},"-","-","-","-","-","-","-","-","-","-",{"$f":"Lists!D142","v":"2021-08-06"}]
[null,"Sudangrass",null,null,null,null,null,null,null,{"$f":"Lists!C143","v":"2021-05-12"},"-","-","-","-","-","-","-","-","-","-",{"$f":"Lists!D143","v":"2021-08-06"}]
[null,"Sunflower",null,null,null,null,null,{"$f":"Lists!C144","v":"2021-04-28"},"-","-","-","-","-","-","-","-","-","-","-","-",{"$f":"Lists!D144","v":"2021-08-06"},"-","-",{"$f":"Lists!E144","v":"2021-08-26"}]
[null,"Sunn Hemp",null,null,null,null,null,null,null,{"$f":"Lists!C145","v":"2021-05-12"},"-","-","-","-","-","-","-","-","-","-",{"$f":"Lists!D145","v":"2021-08-06"},"-","-",{"$f":"Lists!E145","v":"2021-08-26"}]
[null,"Teff",null,null,null,null,null,null,null,{"$f":"Lists!C146","v":"2021-05-12"},"-","-","-","-","-","-","-","-","-","-",{"$f":"Lists!D146","v":"2021-08-06"},"-","-",{"$f":"Lists!E146","v":"2021-08-26"}]
[null,"Triticale, Winter",null,null,null,null,null,null,null,null,null,null,null,null,null,null,null,null,null,null,{"$f":"Lists!F147","v":"2021-08-06"},"-",{"$f":"Lists!G147","v":"2021-08-20"},"-","-","-","-","-","-","-",{"$f":"Lists!H147","v":"2021-10-22"},"-",{"$f":"Lists!I147","v":"2021-11-03"}]
[null,"Turnip",null,null,{"$f":"Lists!B148","v":"2021-04-01"},"-","-","-","-","-","-","-","-","-","-","-","-","-","-","-",{"$f":"Lists!G148","v":"2021-08-06"},"-","-","-",{"$f":"Lists!H148","v":"2021-09-09"},"-",{"$f":"Lists!I148","v":"2021-09-22"}]
[null,"Vetch, Common",null,null,{"$f":"Lists!C149","v":"2021-04-01"},"-","-","-","-","-",{"$f":"Lists!D149","v":"2021-05-18"},null,null,null,null,null,null,null,null,{"$f":"Lists!G149","v":"2021-07-24"},"-","-","-",{"$f":"Lists!H149","v":"2021-08-26"},{"$f":"Lists!I149","v":"2021-09-09"}]
[null,"Vetch, Hairy",null,null,{"$f":"Lists!C150","v":"2021-04-01"},"-","-","-","-","-","-","-",{"$f":"Lists!D150","v":"2021-06-01"},null,null,null,null,null,null,null,{"$f":"Lists!G150","v":"2021-08-06"},"-","-","-",{"$f":"Lists!H150","v":"2021-09-09"},{"$f":"Lists!I150","v":"2021-09-16"}]
[null,"Wheat, Spring",{"$f":"Lists!B151","v":"2021-03-18"},"-",{"$f":"Lists!C151","v":"2021-04-01"},"-","-",{"$f":"Lists!D151","v":"2021-04-28"},"-","-",{"$f":"Lists!E151","v":"2021-05-25"},null,null,null,null,null,null,null,null,null,{"$f":"Lists!F151","v":"2021-08-06"},"-",{"$f":"Lists!G151","v":"2021-08-20"},"-",{"$f":"Lists!H151","v":"2021-09-09"},"-",{"$f":"Lists!I151","v":"2021-09-22"}]
[null,"Wheat, Winter",null,null,null,null,null,null,null,null,null,null,null,null,null,null,null,null,null,null,{"$f":"Lists!F152","v":"2021-08-06"},"-",{"$f":"Lists!G152","v":"2021-08-20"},"-","-","-","-","-",{"$f":"Lists!H152","v":"2021-10-07"},"-",{"$f":"Lists!I152","v":"2021-10-21"}]
[]
[null,"Species","Central"]
[null,null,"March",null,"April",null,null,null,"May",null,null,null,"June",null,null,null,"July",null,null,null,"August",null,null,null,"September",null,null,null,"October",null,null,null,"November"]
[null,"Barley, Spring",{"$f":"Lists!B156","v":"2021-03-18"},"-",{"$f":"Lists!C156","v":"2021-04-01"},"-","-",{"$f":"Lists!D156","v":"2021-04-27"},"-","-",{"$f":"Lists!E156","v":"2021-05-25"},null,null,null,null,null,null,null,null,null,{"$f":"Lists!F156","v":"2021-08-08"},"-",{"$f":"Lists!G156","v":"2021-08-22"},"-",{"$f":"Lists!H156","v":"2021-09-11"},"-",{"$f":"Lists!I156","v":"2021-09-25"}]
[null,"Barley, Winter",null,null,null,null,null,null,null,null,null,null,null,null,null,null,null,null,null,null,{"$f":"Lists!F157","v":"2021-08-08"},"-",{"$f":"Lists!G157","v":"2021-08-22"},"-",{"$f":"Lists!H157","v":"2021-09-11"},"-",{"$f":"Lists!I157","v":"2021-09-25"}]
[null,"Mungbeans",null,null,null,null,null,null,null,{"$f":"Lists!C158","v":"2021-05-11"},"-","-","-","-","-","-","-","-","-","-",{"$f":"Lists!D158","v":"2021-08-07"}]
[null,"Buckwheat",null,null,null,null,null,null,null,{"$f":"Lists!C159","v":"2021-05-11"},"-","-","-","-","-","-","-","-","-","-","-","-","-","-",{"$f":"Lists!H159","v":"2021-09-11"}]
[null,"Camelina, Winter",null,null,null,null,null,null,null,null,null,null,null,null,null,null,null,null,null,null,{"$f":"Lists!F160","v":"2021-08-08"},"-",{"$f":"Lists!G160","v":"2021-08-22"},"-","-","-","-","-","-","-",{"$f":"Lists!H160","v":"2021-10-23"},"-",{"$f":"Lists!I160","v":"2021-11-05"}]
[null,"Clover, Berseem",null,null,{"$f":"Lists!B161","v":"2021-04-01"},{"$f":"Lists!C161","v":"2021-04-14"},"-","-","-","-",{"$f":"Lists!D161","v":"2021-05-18"},null,null,null,null,null,null,null,null,null,{"$f":"Lists!G161","v":"2021-08-08"},"-","-",{"$f":"Lists!H161","v":"2021-08-28"},{"$f":"Lists!I161","v":"2021-09-11"}]
[null,"Clover, Crimson",null,null,{"$f":"Lists!B162","v":"2021-04-01"},{"$f":"Lists!C162","v":"2021-04-14"},"-","-","-","-",{"$f":"Lists!D162","v":"2021-05-18"},null,null,null,null,null,null,null,null,null,{"$f":"Lists!G162","v":"2021-08-08"},"-","-",{"$f":"Lists!H162","v":"2021-08-28"},{"$f":"Lists!I162","v":"2021-09-11"}]
[null,"Clover, Red",{"$f":"Lists!B163","v":"2021-03-18"},"-",{"$f":"Lists!C163","v":"2021-04-01"},"-","-","-","-","-",{"$f":"Lists!D163","v":"2021-05-18"},null,null,null,null,null,null,null,null,null,{"$f":"Lists!G163","v":"2021-08-08"},"-","-","-",{"$f":"Lists!H163","v":"2021-09-11"},{"$f":"Lists!I163","v":"2021-09-18"}]
[null,"Clover, White",{"$f":"Lists!B164","v":"2021-03-18"},"-",{"$f":"Lists!C164","v":"2021-04-01"},"-","-","-","-","-",{"$f":"Lists!D164","v":"2021-05-18"},null,null,null,null,null,null,null,null,null,{"$f":"Lists!G164","v":"2021-08-08"},"-","-","-",{"$f":"Lists!H164","v":"2021-09-11"},{"$f":"Lists!I164","v":"2021-09-18"}]
[null,"Cowpea",null,null,null,null,null,null,null,{"$f":"Lists!C165","v":"2021-05-11"},"-","-","-","-","-","-","-","-","-","-",{"$f":"Lists!D165","v":"2021-08-07"}]
[null,"Flax",{"$f":"Lists!B166","v":"2021-03-18"},"-",{"$f":"Lists!C166","v":"2021-04-01"},"-","-","-","-",{"$f":"Lists!D166","v":"2021-05-11"},"-",{"$f":"Lists!E166","v":"2021-06-01"},null,null,null,null,null,null,{"$f":"Lists!F166","v":"2021-07-18"},"-",{"$f":"Lists!G166","v":"2021-08-08"},"-","-","-",{"$f":"Lists!H166","v":"2021-09-11"},"-",{"$f":"Lists!I166","v":"2021-09-25"}]
[null,"Kale",{"$f":"Lists!B167","v":"2021-03-18"},"-",{"$f":"Lists!C167","v":"2021-04-01"},"-","-","-","-",{"$f":"Lists!D167","v":"2021-05-13"},null,null,null,null,null,null,{"$f":"Lists!F167","v":"2021-07-04"},"-","-",{"$f":"Lists!G167","v":"2021-07-25"},"-","-","-","-",{"$f":"Lists!H167","v":"2021-09-11"},"-",{"$f":"Lists!I167","v":"2021-09-25"}]
[null,"Millet",null,null,null,null,null,null,null,{"$f":"Lists!C168","v":"2021-05-11"},"-","-","-","-","-","-","-","-","-","-",{"$f":"Lists!D168","v":"2021-08-07"}]
[null,"Mustard",{"$f":"Lists!B169","v":"2021-03-18"},"-",{"$f":"Lists!C169","v":"2021-04-01"},"-","-","-","-",{"$f":"Lists!D169","v":"2021-05-13"},null,null,null,null,null,null,null,null,null,null,{"$f":"Lists!G169","v":"2021-08-08"},"-","-","-",{"$f":"Lists!H169","v":"2021-09-11"},"-",{"$f":"Lists!I169","v":"2021-09-25"}]
[null,"Oats",{"$f":"Lists!B170","v":"2021-03-18"},"-",{"$f":"Lists!C170","v":"2021-04-01"},"-","-",{"$f":"Lists!D170","v":"2021-04-27"},"-","-","-","-","-","-","-","-","-","-","-","-","-","-",{"$f":"Lists!G170","v":"2021-08-22"},"-",{"$f":"Lists!H170","v":"2021-09-11"},"-",{"$f":"Lists!I170","v":"2021-09-25"}]
[null,"Pea, Field/Winter",null,null,{"$f":"Lists!C171","v":"2021-04-01"},"-","-","-","-","-",{"$f":"Lists!D171","v":"2021-05-18"},null,null,null,null,null,null,null,null,null,{"$f":"Lists!G171","v":"2021-08-08"},"-","-",{"$f":"Lists!H171","v":"2021-08-28"},{"$f":"Lists!I171","v":"2021-09-11"}]
[null,"Radish",null,null,{"$f":"Lists!B172","v":"2021-04-01"},"-","-","-","-","-","-","-","-","-","-","-","-","-","-","-",{"$f":"Lists!G172","v":"2021-08-08"},"-","-","-",{"$f":"Lists!H172","v":"2021-09-11"},"-",{"$f":"Lists!I172","v":"2021-09-25"}]
[null,"Rapeseed",{"$f":"Lists!B173","v":"2021-03-18"},"-",{"$f":"Lists!C173","v":"2021-04-01"},"-","-","-","-",{"$f":"Lists!D173","v":"2021-05-11"},"-","-","-","-","-","-","-","-","-","-",{"$f":"Lists!G173","v":"2021-08-08"},"-","-","-",{"$f":"Lists!H173","v":"2021-09-11"},"-",{"$f":"Lists!I173","v":"2021-09-25"}]
[null,"Rye, Winter/Cereal",null,null,null,null,null,null,null,null,null,null,null,null,null,null,null,null,null,null,{"$f":"Lists!F174","v":"2021-08-08"},"-",{"$f":"Lists!G174","v":"2021-08-22"},"-","-","-","-","-","-","-",{"$f":"Lists!H174","v":"2021-10-23"},"-",{"$f":"Lists!I174","v":"2021-11-05"}]
[null,"Ryegrass, Annual",null,null,{"$f":"Lists!C175","v":"2021-04-01"},"-","-","-","-",{"$f":"Lists!D175","v":"2021-05-11"},"-","-","-",{"$f":"Lists!E175","v":"2021-06-15"},null,null,null,null,{"$f":"Lists!G175","v":"2021-07-18"},"-","-","-",{"$f":"Lists!H175","v":"2021-08-21"},"-","-","-",{"$f":"Lists!I175","v":"2021-09-25"}]
[null,"Sorghum, Forage",null,null,null,null,null,null,null,{"$f":"Lists!C176","v":"2021-05-11"},"-","-","-","-","-","-","-","-","-","-",{"$f":"Lists!D176","v":"2021-08-07"}]
[null,"Sorghum-Sudangrass",null,null,null,null,null,null,null,{"$f":"Lists!C177","v":"2021-05-11"},"-","-","-","-","-","-","-","-","-","-",{"$f":"Lists!D177","v":"2021-08-07"}]
[null,"Sudangrass",null,null,null,null,null,null,null,{"$f":"Lists!C178","v":"2021-05-11"},"-","-","-","-","-","-","-","-","-","-",{"$f":"Lists!D178","v":"2021-08-07"}]
[null,"Sunflower",null,null,null,null,null,{"$f":"Lists!C179","v":"2021-04-27"},"-","-","-","-","-","-","-","-","-","-","-","-",{"$f":"Lists!D179","v":"2021-08-07"},"-","-",{"$f":"Lists!E179","v":"2021-08-28"}]
[null,"Sunn Hemp",null,null,null,null,null,null,null,{"$f":"Lists!C180","v":"2021-05-11"},"-","-","-","-","-","-","-","-","-","-",{"$f":"Lists!D180","v":"2021-08-07"},"-","-",{"$f":"Lists!E180","v":"2021-08-28"}]
[null,"Teff",null,null,null,null,null,null,null,{"$f":"Lists!C181","v":"2021-05-11"},"-","-","-","-","-","-","-","-","-","-",{"$f":"Lists!D181","v":"2021-08-07"},"-","-",{"$f":"Lists!E181","v":"2021-08-28"}]
[null,"Triticale, Winter",null,null,null,null,null,null,null,null,null,null,null,null,null,null,null,null,null,null,{"$f":"Lists!F182","v":"2021-08-08"},"-",{"$f":"Lists!G182","v":"2021-08-22"},"-","-","-","-","-","-","-",{"$f":"Lists!H182","v":"2021-10-23"},"-",{"$f":"Lists!I182","v":"2021-11-05"}]
[null,"Turnip",null,null,{"$f":"Lists!B183","v":"2021-04-01"},"-","-","-","-","-","-","-","-","-","-","-","-","-","-","-",{"$f":"Lists!G183","v":"2021-08-08"},"-","-","-",{"$f":"Lists!H183","v":"2021-09-11"},"-",{"$f":"Lists!I183","v":"2021-09-25"}]
[null,"Vetch, Common",null,null,{"$f":"Lists!C184","v":"2021-04-01"},"-","-","-","-","-",{"$f":"Lists!D184","v":"2021-05-18"},null,null,null,null,null,null,null,null,{"$f":"Lists!G184","v":"2021-07-25"},"-","-","-",{"$f":"Lists!H184","v":"2021-08-28"},{"$f":"Lists!I184","v":"2021-09-11"}]
[null,"Vetch, Hairy",null,null,{"$f":"Lists!C185","v":"2021-04-01"},"-","-","-","-","-","-","-",{"$f":"Lists!D185","v":"2021-06-01"},null,null,null,null,null,null,null,{"$f":"Lists!G185","v":"2021-08-08"},"-","-","-",{"$f":"Lists!H185","v":"2021-09-11"},{"$f":"Lists!I185","v":"2021-09-18"}]
[null,"Wheat, Spring",{"$f":"Lists!B186","v":"2021-03-18"},"-",{"$f":"Lists!C186","v":"2021-04-01"},"-","-",{"$f":"Lists!D186","v":"2021-04-27"},"-","-",{"$f":"Lists!E186","v":"2021-05-25"},null,null,null,null,null,null,null,null,null,{"$f":"Lists!F186","v":"2021-08-08"},"-",{"$f":"Lists!G186","v":"2021-08-22"},"-",{"$f":"Lists!H186","v":"2021-09-11"},"-",{"$f":"Lists!I186","v":"2021-09-25"}]
[null,"Wheat, Winter",null,null,null,null,null,null,null,null,null,null,null,null,null,null,null,null,null,null,{"$f":"Lists!F187","v":"2021-08-08"},"-",{"$f":"Lists!G187","v":"2021-08-22"},"-","-","-","-","-",{"$f":"Lists!H187","v":"2021-10-10"},"-",{"$f":"Lists!I187","v":"2021-10-22"}]
[]
[null,"Species","East Central"]
[null,null,"March",null,"April",null,null,null,"May",null,null,null,"June",null,null,null,"July",null,null,null,"August",null,null,null,"September",null,null,null,"October",null,null,null,"November"]
[null,"Barley, Spring",{"$f":"Lists!B191","v":"2021-03-16"},{"$f":"Lists!C191","v":"2021-03-30"},"-","-","-",{"$f":"Lists!D191","v":"2021-04-24"},"-","-",{"$f":"Lists!E191","v":"2021-05-23"},null,null,null,null,null,null,null,null,null,{"$f":"Lists!F191","v":"2021-08-08"},"-",{"$f":"Lists!G191","v":"2021-08-23"},"-","-",{"$f":"Lists!H191","v":"2021-09-12"},"-",{"$f":"Lists!I191","v":"2021-09-27"}]
[null,"Barley, Winter",null,null,null,null,null,null,null,null,null,null,null,null,null,null,null,null,null,null,{"$f":"Lists!F192","v":"2021-08-08"},"-",{"$f":"Lists!G192","v":"2021-08-23"},"-","-",{"$f":"Lists!H192","v":"2021-09-12"},"-",{"$f":"Lists!I192","v":"2021-09-27"}]
[null,"Mungbeans",null,null,null,null,null,null,null,{"$f":"Lists!C193","v":"2021-05-08"},"-","-","-","-","-","-","-","-","-","-",{"$f":"Lists!D193","v":"2021-08-07"}]
[null,"Buckwheat",null,null,null,null,null,null,null,{"$f":"Lists!C194","v":"2021-05-08"},"-","-","-","-","-","-","-","-","-","-","-","-","-","-","-",{"$f":"Lists!H194","v":"2021-09-12"}]
[null,"Camelina, Winter",null,null,null,null,null,null,null,null,null,null,null,null,null,null,null,null,null,null,{"$f":"Lists!F195","v":"2021-08-08"},"-",{"$f":"Lists!G195","v":"2021-08-23"},"-","-","-","-","-","-","-",{"$f":"Lists!H195","v":"2021-10-25"},"-",{"$f":"Lists!I195","v":"2021-11-06"}]
[null,"Clover, Berseem",null,{"$f":"Lists!B196","v":"2021-03-30"},"-",{"$f":"Lists!C196","v":"2021-04-12"},"-","-","-","-",{"$f":"Lists!D196","v":"2021-05-16"},null,null,null,null,null,null,null,null,null,{"$f":"Lists!G196","v":"2021-08-08"},"-","-",{"$f":"Lists!H196","v":"2021-08-29"},"-",{"$f":"Lists!I196","v":"2021-09-12"}]
[null,"Clover, Crimson",null,{"$f":"Lists!B197","v":"2021-03-30"},"-",{"$f":"Lists!C197","v":"2021-04-12"},"-","-","-","-",{"$f":"Lists!D197","v":"2021-05-16"},null,null,null,null,null,null,null,null,null,{"$f":"Lists!G197","v":"2021-08-08"},"-","-",{"$f":"Lists!H197","v":"2021-08-29"},"-",{"$f":"Lists!I197","v":"2021-09-12"}]
[null,"Clover, Red",{"$f":"Lists!B198","v":"2021-03-16"},{"$f":"Lists!C198","v":"2021-03-30"},"-","-","-","-","-","-",{"$f":"Lists!D198","v":"2021-05-16"},null,null,null,null,null,null,null,null,null,{"$f":"Lists!G198","v":"2021-08-08"},"-","-","-","-",{"$f":"Lists!H198","v":"2021-09-12"},{"$f":"Lists!I198","v":"2021-09-19"}]
[null,"Clover, White",{"$f":"Lists!B199","v":"2021-03-16"},{"$f":"Lists!C199","v":"2021-03-30"},"-","-","-","-","-","-",{"$f":"Lists!D199","v":"2021-05-16"},null,null,null,null,null,null,null,null,null,{"$f":"Lists!G199","v":"2021-08-08"},"-","-","-","-",{"$f":"Lists!H199","v":"2021-09-12"},{"$f":"Lists!I199","v":"2021-09-19"}]
[null,"Cowpea",null,null,null,null,null,null,null,{"$f":"Lists!C200","v":"2021-05-08"},"-","-","-","-","-","-","-","-","-","-",{"$f":"Lists!D200","v":"2021-08-07"}]
[null,"Flax",{"$f":"Lists!B201","v":"2021-03-16"},{"$f":"Lists!C201","v":"2021-03-30"},"-","-","-","-","-",{"$f":"Lists!D201","v":"2021-05-08"},"-",{"$f":"Lists!E201","v":"2021-05-30"},null,null,null,null,null,null,{"$f":"Lists!F201","v":"2021-07-18"},"-",{"$f":"Lists!G201","v":"2021-08-08"},"-","-","-","-",{"$f":"Lists!H201","v":"2021-09-12"},"-",{"$f":"Lists!I201","v":"2021-09-27"}]
[null,"Kale",{"$f":"Lists!B202","v":"2021-03-16"},{"$f":"Lists!C202","v":"2021-03-30"},"-","-","-","-","-",{"$f":"Lists!D202","v":"2021-05-11"},null,null,null,null,null,null,{"$f":"Lists!F202","v":"2021-07-03"},"-","-",{"$f":"Lists!G202","v":"2021-07-25"},"-","-","-","-","-",{"$f":"Lists!H202","v":"2021-09-12"},"-",{"$f":"Lists!I202","v":"2021-09-27"}]
[null,"Millet",null,null,null,null,null,null,null,{"$f":"Lists!C203","v":"2021-05-07"},"-","-","-","-","-","-","-","-","-","-",{"$f":"Lists!D203","v":"2021-08-07"}]
[null,"Mustard",{"$f":"Lists!B204","v":"2021-03-16"},{"$f":"Lists!C204","v":"2021-03-30"},"-","-","-","-","-",{"$f":"Lists!D204","v":"2021-05-11"},null,null,null,null,null,null,null,null,null,null,{"$f":"Lists!G204","v":"2021-08-08"},"-","-","-","-",{"$f":"Lists!H204","v":"2021-09-12"},"-",{"$f":"Lists!I204","v":"2021-09-27"}]
[null,"Oats",{"$f":"Lists!B205","v":"2021-03-16"},{"$f":"Lists!C205","v":"2021-03-30"},"-","-","-",{"$f":"Lists!D205","v":"2021-04-24"},"-","-","-","-","-","-","-","-","-","-","-","-","-","-",{"$f":"Lists!G205","v":"2021-08-23"},"-","-",{"$f":"Lists!H205","v":"2021-09-12"},"-",{"$f":"Lists!I205","v":"2021-09-27"}]
[null,"Pea, Field/Winter",null,{"$f":"Lists!C206","v":"2021-03-30"},"-","-","-","-","-","-",{"$f":"Lists!D206","v":"2021-05-16"},null,null,null,null,null,null,null,null,null,{"$f":"Lists!G206","v":"2021-08-08"},"-","-",{"$f":"Lists!H206","v":"2021-08-29"},"-",{"$f":"Lists!I206","v":"2021-09-12"}]
[null,"Radish",null,{"$f":"Lists!B207","v":"2021-03-30"},"-","-","-","-","-","-","-","-","-","-","-","-","-","-","-","-",{"$f":"Lists!G207","v":"2021-08-08"},"-","-","-","-",{"$f":"Lists!H207","v":"2021-09-12"},"-",{"$f":"Lists!I207","v":"2021-09-27"}]
[null,"Rapeseed",{"$f":"Lists!B208","v":"2021-03-16"},{"$f":"Lists!C208","v":"2021-03-30"},"-","-","-","-","-",{"$f":"Lists!D208","v":"2021-05-08"},"-","-","-","-","-","-","-","-","-","-",{"$f":"Lists!G208","v":"2021-08-08"},"-","-","-","-",{"$f":"Lists!H208","v":"2021-09-12"},"-",{"$f":"Lists!I208","v":"2021-09-27"}]
[null,"Rye, Winter/Cereal",null,null,null,null,null,null,null,null,null,null,null,null,null,null,null,null,null,null,{"$f":"Lists!F209","v":"2021-08-08"},"-",{"$f":"Lists!G209","v":"2021-08-23"},"-","-","-","-","-","-","-",{"$f":"Lists!H209","v":"2021-10-25"},"-",{"$f":"Lists!I209","v":"2021-11-06"}]
[null,"Ryegrass, Annual",null,{"$f":"Lists!C210","v":"2021-03-30"},"-","-","-","-","-",{"$f":"Lists!D210","v":"2021-05-08"},"-","-","-",{"$f":"Lists!E210","v":"2021-06-14"},null,null,null,null,{"$f":"Lists!G210","v":"2021-07-18"},"-","-","-",{"$f":"Lists!H210","v":"2021-08-22"},"-","-","-","-",{"$f":"Lists!I210","v":"2021-09-27"}]
[null,"Sorghum, Forage",null,null,null,null,null,null,null,{"$f":"Lists!C211","v":"2021-05-08"},"-","-","-","-","-","-","-","-","-","-",{"$f":"Lists!D211","v":"2021-08-07"}]
[null,"Sorghum-Sudangrass",null,null,null,null,null,null,null,{"$f":"Lists!C212","v":"2021-05-08"},"-","-","-","-","-","-","-","-","-","-",{"$f":"Lists!D212","v":"2021-08-07"}]
[null,"Sudangrass",null,null,null,null,null,null,null,{"$f":"Lists!C213","v":"2021-05-08"},"-","-","-","-","-","-","-","-","-","-",{"$f":"Lists!D213","v":"2021-08-07"}]
[null,"Sunflower",null,null,null,null,null,{"$f":"Lists!C214","v":"2021-04-24"},"-","-","-","-","-","-","-","-","-","-","-","-",{"$f":"Lists!D214","v":"2021-08-07"},"-","-",{"$f":"Lists!E214","v":"2021-08-29"}]
[null,"Sunn Hemp",null,null,null,null,null,null,null,{"$f":"Lists!C215","v":"2021-05-08"},"-","-","-","-","-","-","-","-","-","-",{"$f":"Lists!D215","v":"2021-08-07"},"-","-",{"$f":"Lists!E215","v":"2021-08-29"}]
[null,"Teff",null,null,null,null,null,null,null,{"$f":"Lists!C216","v":"2021-05-08"},"-","-","-","-","-","-","-","-","-","-",{"$f":"Lists!D216","v":"2021-08-07"},"-","-",{"$f":"Lists!E216","v":"2021-08-29"}]
[null,"Triticale, Winter",null,null,null,null,null,null,null,null,null,null,null,null,null,null,null,null,null,null,{"$f":"Lists!F217","v":"2021-08-08"},"-",{"$f":"Lists!G217","v":"2021-08-23"},"-","-","-","-","-","-","-",{"$f":"Lists!H217","v":"2021-10-25"},"-",{"$f":"Lists!I217","v":"2021-11-06"}]
[null,"Turnip",null,{"$f":"Lists!B218","v":"2021-03-30"},"-","-","-","-","-","-","-","-","-","-","-","-","-","-","-","-",{"$f":"Lists!G218","v":"2021-08-08"},"-","-","-","-",{"$f":"Lists!H218","v":"2021-09-12"},"-",{"$f":"Lists!I218","v":"2021-09-27"}]
[null,"Vetch, Common",null,{"$f":"Lists!C219","v":"2021-03-30"},"-","-","-","-","-","-",{"$f":"Lists!D219","v":"2021-05-16"},null,null,null,null,null,null,null,null,{"$f":"Lists!G219","v":"2021-07-25"},"-","-","-",{"$f":"Lists!H219","v":"2021-08-29"},"-",{"$f":"Lists!I219","v":"2021-09-12"}]
[null,"Vetch, Hairy",null,{"$f":"Lists!C220","v":"2021-03-30"},"-","-","-","-","-","-","-",{"$f":"Lists!D220","v":"2021-05-30"},null,null,null,null,null,null,null,null,{"$f":"Lists!G220","v":"2021-08-08"},"-","-","-","-",{"$f":"Lists!H220","v":"2021-09-12"},{"$f":"Lists!I220","v":"2021-09-19"}]
[null,"Wheat, Spring",{"$f":"Lists!B221","v":"2021-03-16"},{"$f":"Lists!C221","v":"2021-03-30"},"-","-","-",{"$f":"Lists!D221","v":"2021-04-24"},"-","-",{"$f":"Lists!E221","v":"2021-05-23"},null,null,null,null,null,null,null,null,null,{"$f":"Lists!F221","v":"2021-08-08"},"-",{"$f":"Lists!G221","v":"2021-08-23"},"-","-",{"$f":"Lists!H221","v":"2021-09-12"},"-",{"$f":"Lists!I221","v":"2021-09-27"}]
[null,"Wheat, Winter",null,null,null,null,null,null,null,null,null,null,null,null,null,null,null,null,null,null,{"$f":"Lists!F222","v":"2021-08-08"},"-",{"$f":"Lists!G222","v":"2021-08-23"},"-","-","-","-","-",{"$f":"Lists!H222","v":"2021-10-12"},"-",{"$f":"Lists!I222","v":"2021-10-24"}]
[]
[null,"Species","Southwest"]
[null,null,"March",null,"April",null,null,null,"May",null,null,null,"June",null,null,null,"July",null,null,null,"August",null,null,null,"September",null,null,null,"October",null,null,null,"November"]
[null,"Barley, Spring",{"$f":"Lists!B226","v":"2021-03-13"},{"$f":"Lists!C226","v":"2021-03-27"},"-","-","-",{"$f":"Lists!D226","v":"2021-04-23"},"-","-",{"$f":"Lists!E226","v":"2021-05-22"},null,null,null,null,null,null,null,null,null,{"$f":"Lists!F226","v":"2021-08-07"},"-",{"$f":"Lists!G226","v":"2021-08-21"},"-",{"$f":"Lists!H226","v":"2021-09-10"},"-","-",{"$f":"Lists!I226","v":"2021-09-25"}]
[null,"Barley, Winter",null,null,null,null,null,null,null,null,null,null,null,null,null,null,null,null,null,null,{"$f":"Lists!F227","v":"2021-08-07"},"-",{"$f":"Lists!G227","v":"2021-08-21"},"-",{"$f":"Lists!H227","v":"2021-09-10"},"-","-",{"$f":"Lists!I227","v":"2021-09-25"}]
[null,"Mungbeans",null,null,null,null,null,null,null,{"$f":"Lists!C228","v":"2021-05-07"},"-","-","-","-","-","-","-","-","-","-",{"$f":"Lists!D228","v":"2021-08-05"}]
[null,"Buckwheat",null,null,null,null,null,null,null,{"$f":"Lists!C229","v":"2021-05-07"},"-","-","-","-","-","-","-","-","-","-","-","-","-","-",{"$f":"Lists!H229","v":"2021-09-10"}]
[null,"Camelina, Winter",null,null,null,null,null,null,null,null,null,null,null,null,null,null,null,null,null,null,{"$f":"Lists!F230","v":"2021-08-07"},"-",{"$f":"Lists!G230","v":"2021-08-21"},"-","-","-","-","-","-","-","-",{"$f":"Lists!H230","v":"2021-10-26"},{"$f":"Lists!I230","v":"2021-11-08"}]
[null,"Clover, Berseem",null,{"$f":"Lists!B231","v":"2021-03-27"},"-",{"$f":"Lists!C231","v":"2021-04-10"},"-","-","-","-",{"$f":"Lists!D231","v":"2021-05-15"},null,null,null,null,null,null,null,null,null,{"$f":"Lists!G231","v":"2021-08-07"},"-","-",{"$f":"Lists!H231","v":"2021-08-27"},{"$f":"Lists!I231","v":"2021-09-10"}]
[null,"Clover, Crimson",null,{"$f":"Lists!B232","v":"2021-03-27"},"-",{"$f":"Lists!C232","v":"2021-04-10"},"-","-","-","-",{"$f":"Lists!D232","v":"2021-05-15"},null,null,null,null,null,null,null,null,null,{"$f":"Lists!G232","v":"2021-08-07"},"-","-",{"$f":"Lists!H232","v":"2021-08-27"},{"$f":"Lists!I232","v":"2021-09-10"}]
[null,"Clover, Red",{"$f":"Lists!B233","v":"2021-03-14"},{"$f":"Lists!C233","v":"2021-03-27"},"-","-","-","-","-","-",{"$f":"Lists!D233","v":"2021-05-15"},null,null,null,null,null,null,null,null,null,{"$f":"Lists!G233","v":"2021-08-07"},"-","-","-",{"$f":"Lists!H233","v":"2021-09-10"},"-",{"$f":"Lists!I233","v":"2021-09-17"}]
[null,"Clover, White",{"$f":"Lists!B234","v":"2021-03-14"},{"$f":"Lists!C234","v":"2021-03-27"},"-","-","-","-","-","-",{"$f":"Lists!D234","v":"2021-05-15"},null,null,null,null,null,null,null,null,null,{"$f":"Lists!G234","v":"2021-08-07"},"-","-","-",{"$f":"Lists!H234","v":"2021-09-10"},"-",{"$f":"Lists!I234","v":"2021-09-17"}]
[null,"Cowpea",null,null,null,null,null,null,null,{"$f":"Lists!C235","v":"2021-05-07"},"-","-","-","-","-","-","-","-","-","-",{"$f":"Lists!D235","v":"2021-08-05"}]
[null,"Flax",{"$f":"Lists!B236","v":"2021-03-14"},{"$f":"Lists!C236","v":"2021-03-27"},"-","-","-","-","-",{"$f":"Lists!D236","v":"2021-05-07"},"-",{"$f":"Lists!E236","v":"2021-05-29"},null,null,null,null,null,{"$f":"Lists!F236","v":"2021-07-16"},"-","-",{"$f":"Lists!G236","v":"2021-08-07"},"-","-","-",{"$f":"Lists!H236","v":"2021-09-10"},"-","-",{"$f":"Lists!I236","v":"2021-09-25"}]
[null,"Kale",{"$f":"Lists!B237","v":"2021-03-14"},{"$f":"Lists!C237","v":"2021-03-27"},"-","-","-","-","-",{"$f":"Lists!D237","v":"2021-05-09"},null,null,null,null,null,null,{"$f":"Lists!F237","v":"2021-07-02"},"-","-",{"$f":"Lists!G237","v":"2021-07-23"},"-","-","-","-",{"$f":"Lists!H237","v":"2021-09-10"},"-","-",{"$f":"Lists!I237","v":"2021-09-25"}]
[null,"Millet",null,null,null,null,null,null,null,{"$f":"Lists!C238","v":"2021-05-07"},"-","-","-","-","-","-","-","-","-","-",{"$f":"Lists!D238","v":"2021-08-05"}]
[null,"Mustard",{"$f":"Lists!B239","v":"2021-03-14"},{"$f":"Lists!C239","v":"2021-03-27"},"-","-","-","-","-",{"$f":"Lists!D239","v":"2021-05-09"},null,null,null,null,null,null,null,null,null,null,{"$f":"Lists!G239","v":"2021-08-07"},"-","-","-",{"$f":"Lists!H239","v":"2021-09-10"},"-","-",{"$f":"Lists!I239","v":"2021-09-25"}]
[null,"Oats",{"$f":"Lists!B240","v":"2021-03-13"},{"$f":"Lists!C240","v":"2021-03-27"},"-","-","-",{"$f":"Lists!D240","v":"2021-04-23"},"-","-","-","-","-","-","-","-","-","-","-","-","-","-",{"$f":"Lists!G240","v":"2021-08-21"},"-",{"$f":"Lists!H240","v":"2021-09-10"},"-","-",{"$f":"Lists!I240","v":"2021-09-25"}]
[null,"Pea, Field/Winter",null,{"$f":"Lists!C241","v":"2021-03-27"},"-","-","-","-","-","-",{"$f":"Lists!D241","v":"2021-05-15"},null,null,null,null,null,null,null,null,null,{"$f":"Lists!G241","v":"2021-08-07"},"-","-",{"$f":"Lists!H241","v":"2021-08-27"},{"$f":"Lists!I241","v":"2021-09-10"}]
[null,"Radish",null,{"$f":"Lists!B242","v":"2021-03-27"},"-","-","-","-","-","-","-","-","-","-","-","-","-","-","-","-",{"$f":"Lists!G242","v":"2021-08-07"},"-","-","-",{"$f":"Lists!H242","v":"2021-09-10"},"-","-",{"$f":"Lists!I242","v":"2021-09-25"}]
[null,"Rapeseed",{"$f":"Lists!B243","v":"2021-03-14"},{"$f":"Lists!C243","v":"2021-03-27"},"-","-","-","-","-",{"$f":"Lists!D243","v":"2021-05-07"},"-","-","-","-","-","-","-","-","-","-",{"$f":"Lists!G243","v":"2021-08-07"},"-","-","-",{"$f":"Lists!H243","v":"2021-09-10"},"-","-",{"$f":"Lists!I243","v":"2021-09-25"}]
[null,"Rye, Winter/Cereal",null,null,null,null,null,null,null,null,null,null,null,null,null,null,null,null,null,null,{"$f":"Lists!F244","v":"2021-08-07"},"-",{"$f":"Lists!G244","v":"2021-08-21"},"-","-","-","-","-","-","-","-",{"$f":"Lists!H244","v":"2021-10-26"},{"$f":"Lists!I244","v":"2021-11-08"}]
[null,"Ryegrass, Annual",null,{"$f":"Lists!C245","v":"2021-03-27"},"-","-","-","-","-",{"$f":"Lists!D245","v":"2021-05-07"},"-","-","-",{"$f":"Lists!E245","v":"2021-06-12"},null,null,null,null,{"$f":"Lists!G245","v":"2021-07-16"},"-","-","-",{"$f":"Lists!H245","v":"2021-08-20"},"-","-","-","-",{"$f":"Lists!I245","v":"2021-09-25"}]
[null,"Sorghum, Forage",null,null,null,null,null,null,null,{"$f":"Lists!C246","v":"2021-05-07"},"-","-","-","-","-","-","-","-","-","-",{"$f":"Lists!D246","v":"2021-08-05"}]
[null,"Sorghum-Sudangrass",null,null,null,null,null,null,null,{"$f":"Lists!C247","v":"2021-05-07"},"-","-","-","-","-","-","-","-","-","-",{"$f":"Lists!D247","v":"2021-08-05"}]
[null,"Sudangrass",null,null,null,null,null,null,null,{"$f":"Lists!C248","v":"2021-05-07"},"-","-","-","-","-","-","-","-","-","-",{"$f":"Lists!D248","v":"2021-08-05"}]
[null,"Sunflower",null,null,null,null,null,{"$f":"Lists!C249","v":"2021-04-23"},"-","-","-","-","-","-","-","-","-","-","-","-",{"$f":"Lists!D249","v":"2021-08-05"},"-","-",{"$f":"Lists!E249","v":"2021-08-27"}]
[null,"Sunn Hemp",null,null,null,null,null,null,null,{"$f":"Lists!C250","v":"2021-05-07"},"-","-","-","-","-","-","-","-","-","-",{"$f":"Lists!D250","v":"2021-08-05"},"-","-",{"$f":"Lists!E250","v":"2021-08-27"}]
[null,"Teff",null,null,null,null,null,null,null,{"$f":"Lists!C251","v":"2021-05-07"},"-","-","-","-","-","-","-","-","-","-",{"$f":"Lists!D251","v":"2021-08-05"},"-","-",{"$f":"Lists!E251","v":"2021-08-27"}]
[null,"Triticale, Winter",null,null,null,null,null,null,null,null,null,null,null,null,null,null,null,null,null,null,{"$f":"Lists!F252","v":"2021-08-07"},"-",{"$f":"Lists!G252","v":"2021-08-21"},"-","-","-","-","-","-","-","-",{"$f":"Lists!H252","v":"2021-10-26"},{"$f":"Lists!I252","v":"2021-11-08"}]
[null,"Turnip",null,{"$f":"Lists!B253","v":"2021-03-27"},"-","-","-","-","-","-","-","-","-","-","-","-","-","-","-","-",{"$f":"Lists!G253","v":"2021-08-07"},"-","-","-",{"$f":"Lists!H253","v":"2021-09-10"},"-","-",{"$f":"Lists!I253","v":"2021-09-25"}]
[null,"Vetch, Common",null,{"$f":"Lists!C254","v":"2021-03-27"},"-","-","-","-","-","-",{"$f":"Lists!D254","v":"2021-05-15"},null,null,null,null,null,null,null,null,{"$f":"Lists!G254","v":"2021-07-23"},"-","-","-",{"$f":"Lists!H254","v":"2021-08-27"},{"$f":"Lists!I254","v":"2021-09-10"}]
[null,"Vetch, Hairy",null,{"$f":"Lists!C255","v":"2021-03-27"},"-","-","-","-","-","-","-",{"$f":"Lists!D255","v":"2021-05-29"},null,null,null,null,null,null,null,null,{"$f":"Lists!G255","v":"2021-08-07"},"-","-","-",{"$f":"Lists!H255","v":"2021-09-10"},"-",{"$f":"Lists!I255","v":"2021-09-17"}]
[null,"Wheat, Spring",{"$f":"Lists!B256","v":"2021-03-13"},{"$f":"Lists!C256","v":"2021-03-27"},"-","-","-",{"$f":"Lists!D256","v":"2021-04-23"},"-","-",{"$f":"Lists!E256","v":"2021-05-22"},null,null,null,null,null,null,null,null,null,{"$f":"Lists!F256","v":"2021-08-07"},"-",{"$f":"Lists!G256","v":"2021-08-21"},"-",{"$f":"Lists!H256","v":"2021-09-10"},"-","-",{"$f":"Lists!I256","v":"2021-09-25"}]
[null,"Wheat, Winter",null,null,null,null,null,null,null,null,null,null,null,null,null,null,null,null,null,null,{"$f":"Lists!F257","v":"2021-08-07"},"-",{"$f":"Lists!G257","v":"2021-08-21"},"-","-","-","-","-","-",{"$f":"Lists!H257","v":"2021-10-10"},"-",{"$f":"Lists!I257","v":"2021-10-25"}]
[]
[null,"Species","South Central"]
[null,null,"March",null,"April",null,null,null,"May",null,null,null,"June",null,null,null,"July",null,null,null,"August",null,null,null,"September",null,null,null,"October",null,null,null,"November"]
[null,"Barley, Spring",{"$f":"Lists!B261","v":"2021-03-15"},{"$f":"Lists!C261","v":"2021-03-29"},"-","-","-",{"$f":"Lists!D261","v":"2021-04-23"},"-","-",{"$f":"Lists!E261","v":"2021-05-22"},null,null,null,null,null,null,null,null,null,{"$f":"Lists!F261","v":"2021-08-08"},"-",{"$f":"Lists!G261","v":"2021-08-22"},"-","-",{"$f":"Lists!H261","v":"2021-09-12"},"-",{"$f":"Lists!I261","v":"2021-09-26"}]
[null,"Barley, Winter",null,null,null,null,null,null,null,null,null,null,null,null,null,null,null,null,null,null,{"$f":"Lists!F262","v":"2021-08-08"},"-",{"$f":"Lists!G262","v":"2021-08-22"},"-","-",{"$f":"Lists!H262","v":"2021-09-12"},"-",{"$f":"Lists!I262","v":"2021-09-26"}]
[null,"Mungbeans",null,null,null,null,null,null,null,{"$f":"Lists!C263","v":"2021-05-08"},"-","-","-","-","-","-","-","-","-","-",{"$f":"Lists!D263","v":"2021-08-07"}]
[null,"Buckwheat",null,null,null,null,null,null,null,{"$f":"Lists!C264","v":"2021-05-08"},"-","-","-","-","-","-","-","-","-","-","-","-","-","-","-",{"$f":"Lists!H264","v":"2021-09-12"}]
[null,"Camelina, Winter",null,null,null,null,null,null,null,null,null,null,null,null,null,null,null,null,null,null,{"$f":"Lists!F265","v":"2021-08-08"},"-",{"$f":"Lists!G265","v":"2021-08-22"},"-","-","-","-","-","-","-","-",{"$f":"Lists!H265","v":"2021-10-27"},{"$f":"Lists!I265","v":"2021-11-10"}]
[null,"Clover, Berseem",null,{"$f":"Lists!B266","v":"2021-03-29"},"-",{"$f":"Lists!C266","v":"2021-04-11"},"-","-","-","-",{"$f":"Lists!D266","v":"2021-05-15"},null,null,null,null,null,null,null,null,null,{"$f":"Lists!G266","v":"2021-08-08"},"-","-",{"$f":"Lists!H266","v":"2021-08-28"},"-",{"$f":"Lists!I266","v":"2021-09-12"}]
[null,"Clover, Crimson",null,{"$f":"Lists!B267","v":"2021-03-29"},"-",{"$f":"Lists!C267","v":"2021-04-11"},"-","-","-","-",{"$f":"Lists!D267","v":"2021-05-15"},null,null,null,null,null,null,null,null,null,{"$f":"Lists!G267","v":"2021-08-08"},"-","-",{"$f":"Lists!H267","v":"2021-08-28"},"-",{"$f":"Lists!I267","v":"2021-09-12"}]
[null,"Clover, Red",{"$f":"Lists!B268","v":"2021-03-15"},{"$f":"Lists!C268","v":"2021-03-29"},"-","-","-","-","-","-",{"$f":"Lists!D268","v":"2021-05-15"},null,null,null,null,null,null,null,null,null,{"$f":"Lists!G268","v":"2021-08-08"},"-","-","-","-",{"$f":"Lists!H268","v":"2021-09-12"},{"$f":"Lists!I268","v":"2021-09-19"}]
[null,"Clover, White",{"$f":"Lists!B269","v":"2021-03-15"},{"$f":"Lists!C269","v":"2021-03-29"},"-","-","-","-","-","-",{"$f":"Lists!D269","v":"2021-05-15"},null,null,null,null,null,null,null,null,null,{"$f":"Lists!G269","v":"2021-08-08"},"-","-","-","-",{"$f":"Lists!H269","v":"2021-09-12"},{"$f":"Lists!I269","v":"2021-09-19"}]
[null,"Cowpea",null,null,null,null,null,null,null,{"$f":"Lists!C270","v":"2021-05-08"},"-","-","-","-","-","-","-","-","-","-",{"$f":"Lists!D270","v":"2021-08-07"}]
[null,"Flax",{"$f":"Lists!B271","v":"2021-03-15"},{"$f":"Lists!C271","v":"2021-03-29"},"-","-","-","-","-",{"$f":"Lists!D271","v":"2021-05-08"},"-",{"$f":"Lists!E271","v":"2021-05-29"},null,null,null,null,null,null,{"$f":"Lists!F271","v":"2021-07-17"},"-",{"$f":"Lists!G271","v":"2021-08-08"},"-","-","-","-",{"$f":"Lists!H271","v":"2021-09-12"},"-",{"$f":"Lists!I271","v":"2021-09-26"}]
[null,"Kale",{"$f":"Lists!B272","v":"2021-03-15"},{"$f":"Lists!C272","v":"2021-03-29"},"-","-","-","-","-",{"$f":"Lists!D272","v":"2021-05-10"},null,null,null,null,null,null,{"$f":"Lists!F272","v":"2021-07-03"},"-","-",{"$f":"Lists!G272","v":"2021-07-24"},"-","-","-","-","-",{"$f":"Lists!H272","v":"2021-09-12"},"-",{"$f":"Lists!I272","v":"2021-09-26"}]
[null,"Millet",null,null,null,null,null,null,null,{"$f":"Lists!C273","v":"2021-05-08"},"-","-","-","-","-","-","-","-","-","-",{"$f":"Lists!D273","v":"2021-08-07"}]
[null,"Mustard",{"$f":"Lists!B274","v":"2021-03-15"},{"$f":"Lists!C274","v":"2021-03-29"},"-","-","-","-","-",{"$f":"Lists!D274","v":"2021-05-10"},null,null,null,null,null,null,null,null,null,null,{"$f":"Lists!G274","v":"2021-08-08"},"-","-","-","-",{"$f":"Lists!H274","v":"2021-09-12"},"-",{"$f":"Lists!I274","v":"2021-09-26"}]
[null,"Oats",{"$f":"Lists!B275","v":"2021-03-15"},{"$f":"Lists!C275","v":"2021-03-29"},"-","-","-",{"$f":"Lists!D275","v":"2021-04-23"},"-","-","-","-","-","-","-","-","-","-","-","-","-","-",{"$f":"Lists!G275","v":"2021-08-22"},"-","-",{"$f":"Lists!H275","v":"2021-09-12"},"-",{"$f":"Lists!I275","v":"2021-09-26"}]
[null,"Pea, Field/Winter",null,{"$f":"Lists!C276","v":"2021-03-29"},"-","-","-","-","-","-",{"$f":"Lists!D276","v":"2021-05-15"},null,null,null,null,null,null,null,null,null,{"$f":"Lists!G276","v":"2021-08-08"},"-","-",{"$f":"Lists!H276","v":"2021-08-28"},"-",{"$f":"Lists!I276","v":"2021-09-12"}]
[null,"Radish",null,{"$f":"Lists!B277","v":"2021-03-29"},"-","-","-","-","-","-","-","-","-","-","-","-","-","-","-","-",{"$f":"Lists!G277","v":"2021-08-08"},"-","-","-","-",{"$f":"Lists!H277","v":"2021-09-12"},"-",{"$f":"Lists!I277","v":"2021-09-26"}]
[null,"Rapeseed",{"$f":"Lists!B278","v":"2021-03-15"},{"$f":"Lists!C278","v":"2021-03-29"},"-","-","-","-","-",{"$f":"Lists!D278","v":"2021-05-08"},"-","-","-","-","-","-","-","-","-","-",{"$f":"Lists!G278","v":"2021-08-08"},"-","-","-","-",{"$f":"Lists!H278","v":"2021-09-12"},"-",{"$f":"Lists!I278","v":"2021-09-26"}]
[null,"Rye, Winter/Cereal",null,null,null,null,null,null,null,null,null,null,null,null,null,null,null,null,null,null,{"$f":"Lists!F279","v":"2021-08-08"},"-",{"$f":"Lists!G279","v":"2021-08-22"},"-","-","-","-","-","-","-","-",{"$f":"Lists!H279","v":"2021-10-27"},{"$f":"Lists!I279","v":"2021-11-10"}]
[null,"Ryegrass, Annual",null,{"$f":"Lists!C280","v":"2021-03-29"},"-","-","-","-","-",{"$f":"Lists!D280","v":"2021-05-08"},"-","-","-",{"$f":"Lists!E280","v":"2021-06-13"},null,null,null,null,{"$f":"Lists!G280","v":"2021-07-17"},"-","-","-",{"$f":"Lists!H280","v":"2021-08-21"},"-","-","-","-",{"$f":"Lists!I280","v":"2021-09-26"}]
[null,"Sorghum, Forage",null,null,null,null,null,null,null,{"$f":"Lists!C281","v":"2021-05-08"},"-","-","-","-","-","-","-","-","-","-",{"$f":"Lists!D281","v":"2021-08-07"}]
[null,"Sorghum-Sudangrass",null,null,null,null,null,null,null,{"$f":"Lists!C282","v":"2021-05-08"},"-","-","-","-","-","-","-","-","-","-",{"$f":"Lists!D282","v":"2021-08-07"}]
[null,"Sudangrass",null,null,null,null,null,null,null,{"$f":"Lists!C283","v":"2021-05-08"},"-","-","-","-","-","-","-","-","-","-",{"$f":"Lists!D283","v":"2021-08-07"}]
[null,"Sunflower",null,null,null,null,null,{"$f":"Lists!C284","v":"2021-04-23"},"-","-","-","-","-","-","-","-","-","-","-","-",{"$f":"Lists!D284","v":"2021-08-07"},"-","-",{"$f":"Lists!E284","v":"2021-08-28"}]
[null,"Sunn Hemp",null,null,null,null,null,null,null,{"$f":"Lists!C285","v":"2021-05-08"},"-","-","-","-","-","-","-","-","-","-",{"$f":"Lists!D285","v":"2021-08-07"},"-","-",{"$f":"Lists!E285","v":"2021-08-28"}]
[null,"Teff",null,null,null,null,null,null,null,{"$f":"Lists!C286","v":"2021-05-08"},"-","-","-","-","-","-","-","-","-","-",{"$f":"Lists!D286","v":"2021-08-07"},"-","-",{"$f":"Lists!E286","v":"2021-08-28"}]
[null,"Triticale, Winter",null,null,null,null,null,null,null,null,null,null,null,null,null,null,null,null,null,null,{"$f":"Lists!F287","v":"2021-08-08"},"-",{"$f":"Lists!G287","v":"2021-08-22"},"-","-","-","-","-","-","-","-",{"$f":"Lists!H287","v":"2021-10-27"},{"$f":"Lists!I287","v":"2021-11-10"}]
[null,"Turnip",null,{"$f":"Lists!B288","v":"2021-03-29"},"-","-","-","-","-","-","-","-","-","-","-","-","-","-","-","-",{"$f":"Lists!G288","v":"2021-08-08"},"-","-","-","-",{"$f":"Lists!H288","v":"2021-09-12"},"-",{"$f":"Lists!I288","v":"2021-09-26"}]
[null,"Vetch, Common",null,{"$f":"Lists!C289","v":"2021-03-29"},"-","-","-","-","-","-",{"$f":"Lists!D289","v":"2021-05-15"},null,null,null,null,null,null,null,null,{"$f":"Lists!G289","v":"2021-07-24"},"-","-","-",{"$f":"Lists!H289","v":"2021-08-28"},"-",{"$f":"Lists!I289","v":"2021-09-12"}]
[null,"Vetch, Hairy",null,{"$f":"Lists!C290","v":"2021-03-29"},"-","-","-","-","-","-","-",{"$f":"Lists!D290","v":"2021-05-29"},null,null,null,null,null,null,null,null,{"$f":"Lists!G290","v":"2021-08-08"},"-","-","-","-",{"$f":"Lists!H290","v":"2021-09-12"},{"$f":"Lists!I290","v":"2021-09-19"}]
[null,"Wheat, Spring",{"$f":"Lists!B291","v":"2021-03-15"},{"$f":"Lists!C291","v":"2021-03-29"},"-","-","-",{"$f":"Lists!C291","v":"2021-03-29"},"-","-",{"$f":"Lists!E291","v":"2021-05-22"},null,null,null,null,null,null,null,null,null,{"$f":"Lists!F291","v":"2021-08-08"},"-",{"$f":"Lists!G291","v":"2021-08-22"},"-","-",{"$f":"Lists!H291","v":"2021-09-12"},"-",{"$f":"Lists!I291","v":"2021-09-26"}]
[null,"Wheat, Winter",null,null,null,null,null,null,null,null,null,null,null,null,null,null,null,null,null,null,{"$f":"Lists!F292","v":"2021-08-08"},"-",{"$f":"Lists!G292","v":"2021-08-22"},"-","-","-","-","-","-",{"$f":"Lists!H292","v":"2021-10-12"},"-",{"$f":"Lists!I292","v":"2021-10-26"}]
[]
[null,"Species","Southeast"]
[null,null,"March",null,"April",null,null,null,"May",null,null,null,"June",null,null,null,"July",null,null,null,"August",null,null,null,"September",null,null,null,"October",null,null,null,"November"]
[null,"Barley, Spring",{"$f":"Lists!B296","v":"2021-03-12"},{"$f":"Lists!C296","v":"2021-03-25"},"-","-",{"$f":"Lists!D296","v":"2021-04-18"},"-","-","-",{"$f":"Lists!E296","v":"2021-05-19"},null,null,null,null,null,null,null,null,null,{"$f":"Lists!F296","v":"2021-08-09"},"-",{"$f":"Lists!G296","v":"2021-08-24"},"-","-",{"$f":"Lists!H296","v":"2021-09-15"},"-","-",{"$f":"Lists!I296","v":"2021-10-01"}]
[null,"Barley, Winter",null,null,null,null,null,null,null,null,null,null,null,null,null,null,null,null,null,null,{"$f":"Lists!F297","v":"2021-08-09"},"-",{"$f":"Lists!G297","v":"2021-08-24"},"-","-",{"$f":"Lists!H297","v":"2021-09-15"},"-","-",{"$f":"Lists!I297","v":"2021-10-01"}]
[null,"Mungbeans",null,null,null,null,null,null,null,{"$f":"Lists!C298","v":"2021-05-04"},"-","-","-","-","-","-","-","-","-","-",{"$f":"Lists!D298","v":"2021-08-08"}]
[null,"Buckwheat",null,null,null,null,null,null,null,{"$f":"Lists!C299","v":"2021-05-04"},"-","-","-","-","-","-","-","-","-","-","-","-","-","-","-",{"$f":"Lists!H299","v":"2021-09-15"}]
[null,"Camelina, Winter",null,null,null,null,null,null,null,null,null,null,null,null,null,null,null,null,null,null,{"$f":"Lists!F300","v":"2021-08-09"},"-",{"$f":"Lists!G300","v":"2021-08-24"},"-","-","-","-","-","-","-","-",{"$f":"Lists!H300","v":"2021-10-31"},"-",{"$f":"Lists!I300","v":"2021-11-15"}]
[null,"Clover, Berseem",null,{"$f":"Lists!B301","v":"2021-03-25"},"-",{"$f":"Lists!C301","v":"2021-04-08"},"-","-","-","-",{"$f":"Lists!D301","v":"2021-05-11"},null,null,null,null,null,null,null,null,null,{"$f":"Lists!G301","v":"2021-08-09"},"-","-",{"$f":"Lists!H301","v":"2021-08-31"},"-",{"$f":"Lists!I301","v":"2021-09-15"}]
[null,"Clover, Crimson",null,{"$f":"Lists!B302","v":"2021-03-25"},"-",{"$f":"Lists!C302","v":"2021-04-08"},"-","-","-","-",{"$f":"Lists!D302","v":"2021-05-11"},null,null,null,null,null,null,null,null,null,{"$f":"Lists!G302","v":"2021-08-09"},"-","-",{"$f":"Lists!H302","v":"2021-08-31"},"-",{"$f":"Lists!I302","v":"2021-09-15"}]
[null,"Clover, Red",{"$f":"Lists!B303","v":"2021-03-12"},{"$f":"Lists!C303","v":"2021-03-25"},"-","-","-","-","-","-",{"$f":"Lists!D303","v":"2021-05-11"},null,null,null,null,null,null,null,null,null,{"$f":"Lists!G303","v":"2021-08-09"},"-","-","-","-",{"$f":"Lists!H303","v":"2021-09-15"},{"$f":"Lists!I303","v":"2021-09-23"}]
[null,"Clover, White",{"$f":"Lists!B304","v":"2021-03-12"},{"$f":"Lists!C304","v":"2021-03-25"},"-","-","-","-","-","-",{"$f":"Lists!D304","v":"2021-05-11"},null,null,null,null,null,null,null,null,null,{"$f":"Lists!G304","v":"2021-08-09"},"-","-","-","-",{"$f":"Lists!H304","v":"2021-09-15"},{"$f":"Lists!I304","v":"2021-09-23"}]
[null,"Cowpea",null,null,null,null,null,null,null,{"$f":"Lists!C305","v":"2021-05-04"},"-","-","-","-","-","-","-","-","-","-",{"$f":"Lists!D305","v":"2021-08-08"}]
[null,"Flax",{"$f":"Lists!B306","v":"2021-03-12"},{"$f":"Lists!C306","v":"2021-03-25"},"-","-","-","-","-",{"$f":"Lists!D306","v":"2021-05-04"},"-",{"$f":"Lists!E306","v":"2021-05-27"},null,null,null,null,null,null,{"$f":"Lists!F306","v":"2021-07-17"},"-",{"$f":"Lists!G306","v":"2021-08-09"},"-","-","-","-",{"$f":"Lists!H306","v":"2021-09-15"},"-","-",{"$f":"Lists!I306","v":"2021-10-01"}]
[null,"Kale",{"$f":"Lists!B307","v":"2021-03-12"},{"$f":"Lists!C307","v":"2021-03-25"},"-","-","-","-","-",{"$f":"Lists!D307","v":"2021-05-06"},null,null,null,null,null,null,{"$f":"Lists!F307","v":"2021-07-02"},"-","-",{"$f":"Lists!G307","v":"2021-07-25"},"-","-","-","-","-",{"$f":"Lists!H307","v":"2021-09-15"},"-","-",{"$f":"Lists!I307","v":"2021-10-01"}]
[null,"Millet",null,null,null,null,null,null,null,{"$f":"Lists!C308","v":"2021-05-04"},"-","-","-","-","-","-","-","-","-","-",{"$f":"Lists!D308","v":"2021-08-08"}]
[null,"Mustard",{"$f":"Lists!B309","v":"2021-03-12"},{"$f":"Lists!C309","v":"2021-03-25"},"-","-","-","-","-",{"$f":"Lists!D309","v":"2021-05-06"},null,null,null,null,null,null,null,null,null,null,{"$f":"Lists!G309","v":"2021-08-09"},"-","-","-","-",{"$f":"Lists!H309","v":"2021-09-15"},"-","-",{"$f":"Lists!I309","v":"2021-10-01"}]
[null,"Oats",{"$f":"Lists!B310","v":"2021-03-12"},{"$f":"Lists!C310","v":"2021-03-25"},"-","-",{"$f":"Lists!D310","v":"2021-04-18"},"-","-","-","-","-","-","-","-","-","-","-","-","-","-","-",{"$f":"Lists!G310","v":"2021-08-24"},"-","-",{"$f":"Lists!H310","v":"2021-09-15"},"-","-",{"$f":"Lists!I310","v":"2021-10-01"}]
[null,"Pea, Field/Winter",null,{"$f":"Lists!C311","v":"2021-03-25"},"-","-","-","-","-","-",{"$f":"Lists!D311","v":"2021-05-11"},null,null,null,null,null,null,null,null,null,{"$f":"Lists!G311","v":"2021-08-09"},"-","-",{"$f":"Lists!H311","v":"2021-08-31"},"-",{"$f":"Lists!I311","v":"2021-09-15"}]
[null,"Radish",null,{"$f":"Lists!B312","v":"2021-03-25"},"-","-","-","-","-","-","-","-","-","-","-","-","-","-","-","-",{"$f":"Lists!G312","v":"2021-08-09"},"-","-","-","-",{"$f":"Lists!H312","v":"2021-09-15"},"-","-",{"$f":"Lists!I312","v":"2021-10-01"}]
[null,"Rapeseed",{"$f":"Lists!B313","v":"2021-03-12"},{"$f":"Lists!C313","v":"2021-03-25"},"-","-","-","-","-",{"$f":"Lists!D313","v":"2021-05-04"},"-","-","-","-","-","-","-","-","-","-",{"$f":"Lists!G313","v":"2021-08-09"},"-","-","-","-",{"$f":"Lists!H313","v":"2021-09-15"},"-","-",{"$f":"Lists!I313","v":"2021-10-01"}]
[null,"Rye, Winter/Cereal",null,null,null,null,null,null,null,null,null,null,null,null,null,null,null,null,null,null,{"$f":"Lists!F314","v":"2021-08-09"},"-",{"$f":"Lists!G314","v":"2021-08-24"},"-","-","-","-","-","-","-","-",{"$f":"Lists!H314","v":"2021-10-31"},"-",{"$f":"Lists!I314","v":"2021-11-15"}]
[null,"Ryegrass, Annual",null,{"$f":"Lists!C315","v":"2021-03-25"},"-","-","-","-","-",{"$f":"Lists!D315","v":"2021-05-04"},"-","-","-",{"$f":"Lists!E315","v":"2021-06-11"},null,null,null,null,{"$f":"Lists!G315","v":"2021-07-17"},"-","-","-",{"$f":"Lists!H315","v":"2021-08-23"},"-","-","-","-","-",{"$f":"Lists!I315","v":"2021-10-01"}]
[null,"Sorghum, Forage",null,null,null,null,null,null,null,{"$f":"Lists!C316","v":"2021-05-04"},"-","-","-","-","-","-","-","-","-","-",{"$f":"Lists!D316","v":"2021-08-08"}]
[null,"Sorghum-Sudangrass",null,null,null,null,null,null,null,{"$f":"Lists!C317","v":"2021-05-04"},"-","-","-","-","-","-","-","-","-","-",{"$f":"Lists!D317","v":"2021-08-08"}]
[null,"Sudangrass",null,null,null,null,null,null,null,{"$f":"Lists!C318","v":"2021-05-04"},"-","-","-","-","-","-","-","-","-","-",{"$f":"Lists!D318","v":"2021-08-08"}]
[null,"Sunflower",null,null,null,null,{"$f":"Lists!C319","v":"2021-04-18"},"-","-","-","-","-","-","-","-","-","-","-","-","-",{"$f":"Lists!D319","v":"2021-08-08"},"-","-",{"$f":"Lists!E319","v":"2021-08-31"}]
[null,"Sunn Hemp",null,null,null,null,null,null,null,{"$f":"Lists!C320","v":"2021-05-04"},"-","-","-","-","-","-","-","-","-","-",{"$f":"Lists!D320","v":"2021-08-08"},"-","-",{"$f":"Lists!E320","v":"2021-08-31"}]
[null,"Teff",null,null,null,null,null,null,null,{"$f":"Lists!C321","v":"2021-05-04"},"-","-","-","-","-","-","-","-","-","-",{"$f":"Lists!D321","v":"2021-08-08"},"-","-",{"$f":"Lists!E321","v":"2021-08-31"}]
[null,"Triticale, Winter"," ",null,null,null,null,null,null,null,null,null,null,null,null,null,null,null,null,null,{"$f":"Lists!F322","v":"2021-08-09"},"-",{"$f":"Lists!G322","v":"2021-08-24"},"-","-","-","-","-","-","-","-",{"$f":"Lists!H322","v":"2021-10-31"},"-",{"$f":"Lists!I322","v":"2021-11-15"}]
[null,"Turnip",null,{"$f":"Lists!B323","v":"2021-03-25"},"-","-","-","-","-","-","-","-","-","-","-","-","-","-","-","-",{"$f":"Lists!G323","v":"2021-08-09"},"-","-","-","-",{"$f":"Lists!H323","v":"2021-09-15"},"-","-",{"$f":"Lists!I323","v":"2021-10-01"}]
[null,"Vetch, Common",null,{"$f":"Lists!C324","v":"2021-03-25"},"-","-","-","-","-","-",{"$f":"Lists!D324","v":"2021-05-11"},null,null,null,null,null,null,null,null,{"$f":"Lists!G324","v":"2021-07-25"},"-","-","-",{"$f":"Lists!H324","v":"2021-08-31"},"-",{"$f":"Lists!I324","v":"2021-09-15"}]
[null,"Vetch, Hairy",null,{"$f":"Lists!C325","v":"2021-03-25"},"-","-","-","-","-","-","-",{"$f":"Lists!D325","v":"2021-05-27"},null,null,null,null,null,null,null,null,{"$f":"Lists!G325","v":"2021-08-09"},"-","-","-","-",{"$f":"Lists!H325","v":"2021-09-15"},{"$f":"Lists!I325","v":"2021-09-23"}]
[null,"Wheat, Spring",{"$f":"Lists!B326","v":"2021-03-12"},{"$f":"Lists!C326","v":"2021-03-25"},"-","-",{"$f":"Lists!D326","v":"2021-04-18"},"-","-","-",{"$f":"Lists!E326","v":"2021-05-19"},null,null,null,null,null,null,null,null,null,{"$f":"Lists!F326","v":"2021-08-09"},"-",{"$f":"Lists!G326","v":"2021-08-24"},"-","-",{"$f":"Lists!H326","v":"2021-09-15"},"-","-",{"$f":"Lists!I326","v":"2021-10-01"}]
[null,"Wheat, Winter",null,null,null,null,null,null,null,null,null,null,null,null,null,null,null,null,null,null,{"$f":"Lists!F327","v":"2021-08-09"},"-",{"$f":"Lists!G327","v":"2021-08-24"},"-","-","-","-","-","-",{"$f":"Lists!H327","v":"2021-10-17"},"-",{"$f":"Lists!I327","v":"2021-10-30"}]

{"sheet":"Rates","index":3,"n_rows":42,"n_cols":7,"rows_kept":42,"cut":false,"hidden":false,"merged":[[41,0,42,6],[0,0,0,6],[1,0,2,0],[1,1,2,1],[1,4,2,4],[1,5,2,5],[1,6,2,6],[37,0,37,1],[26,0,26,1],[18,0,18,1],[12,0,12,1],[3,0,3,1],[29,0,29,1]]}
["IOWA SEEDING RATES *"]
["Species Common Name","Planting Depth (inches)","Single Species Seeding Rates",null,"Approx. Low Temperature Tolerance","Approx. seeds per pound","drilled rate (seeds/sqft)"]
[null,null,"Drilled/Broadcast Incorporated (lbs/ac)","Broadcast Not Incorporated (lbs/ac)"]
["Cool Season Grasses"]
["Annual Ryegrass",{"$f":"Lists!$AG$23","v":"0.25-0.50"},{"$f":"Lists!$AH$23","v":12},{"$f":"Lists!$AI$23","v":14},"to 00F",{"$f":"Lists!$AJ$23","v":190000},{"$f":"(C5*F5)/43560","v":52.341597796143247}]
["Spring Barley",{"$f":"Lists!AG4","v":"0.75-2.0"},{"$f":"Lists!AH4","v":60},{"$f":"Lists!AI4","v":60},"to 250F",{"$f":"Lists!AJ4","v":18000},{"$f":"(C6*F6)/43560","v":24.793388429752067}]
["Winter Barley",{"$f":"Lists!AG5","v":"0.75-2.0"},{"$f":"Lists!AH5","v":60},{"$f":"Lists!AI5","v":60},"to 00F",{"$f":"Lists!AJ5","v":18000},24.793388429752067]
["Oats",{"$f":"Lists!AG18","v":"1.0-2.0"},{"$f":"Lists!AH18","v":60},{"$f":"Lists!AI18","v":60},"to 250F",{"$f":"Lists!AJ18","v":15000},20.66115702479339]
["Winter Cereal Rye",{"$f":"Lists!AG22","v":"0.25-2.0"},{"$f":"Lists!AH22","v":45},{"$f":"Lists!AI22","v":45},"to - 300F",{"$f":"Lists!AJ22","v":12000},12.396694214876034]
["Spring Wheat",{"$f":"Lists!AG34","v":"0.5-1.5"},{"$f":"Lists!AH34","v":60},{"$f":"Lists!AI34","v":66},"20 to 250F",{"$f":"Lists!AJ34","v":14000},19.28374655647383]
["Winter Wheat",{"$f":"Lists!AG35","v":"0.5-1.5"},{"$f":"Lists!AH35","v":45},{"$f":"Lists!AI35","v":45},"to -150F",{"$f":"Lists!AJ35","v":14000},14.462809917355372]
["Winter Triticale",{"$f":"Lists!AG30","v":"1.5-2.0"},{"$f":"Lists!AH30","v":45},{"$f":"Lists!AI30","v":45},"to -200F",{"$f":"Lists!AJ30","v":11000},11.363636363636363]
["Warm Season Grasses"]
["Forage Sorghum",{"$f":"Lists!AG24","v":"0.75-1.5"},{"$f":"Lists!AH24","v":15},{"$f":"Lists!AI24","v":17},"to 320F",{"$f":"Lists!AJ24","v":14000},{"$f":"(C14*F14)/43560","v":4.8209366391184574}]
["Sorghum-Sudangrass",{"$f":"Lists!AG25","v":"0.75-1.5"},{"$f":"Lists!AH25","v":15},{"$f":"Lists!AI25","v":17},"to 320F",{"$f":"Lists!AJ25","v":20000},6.887052341597796]
["Sudangrass",{"$f":"Lists!AG26","v":"0.75-1.6"},{"$f":"Lists!AH26","v":15},{"$f":"Lists!AI26","v":17},"to 320F",{"$f":"Lists!AJ26","v":20000},6.887052341597796]
["Teff",{"$f":"+Lists!AG29","v":0.25},{"$f":"+Lists!AH29","v":4},{"$f":"+Lists!AI29","v":5},"to 320F",{"$f":"Lists!AJ29","v":1000000},91.827364554637285]
["Millets",{"$f":"Lists!AG15","v":"0.5-1.0"},{"$f":"Lists!AH15","v":10},{"$f":"Lists!AI15","v":12},"to 320F",{"$f":"Lists!AJ15","v":80000},18.365472910927455]
["Cool Season Broadleaves"]
["Canola/Rapeseed",{"$f":"Lists!AG21","v":"0.25-1.0"},{"$f":"Lists!AH21","v":3},{"$f":"Lists!AI21","v":4},"to 00F",{"$f":"Lists!AJ21","v":175000},{"$f":"(C20*F20)/43560","v":12.052341597796143}]
["Camelina, Winter",{"$f":"Lists!AG7","v":"0.25-0.5"},{"$f":"Lists!AH7","v":3},{"$f":"Lists!AI7","v":4},"to -200F",{"$f":"Lists!AJ7","v":400000},27.548209366391184]
["Radish",{"$f":"Lists!AG20","v":"0.25-0.5"},{"$f":"Lists!AH20","v":5},{"$f":"Lists!AI20","v":6},"to 150F",{"$f":"Lists!AJ20","v":34000},3.9026629935720845]
["Turnip",{"$f":"Lists!AG31","v":"0.25-0.5"},{"$f":"Lists!AH31","v":3},{"$f":"Lists!AI31","v":4},"to 100F",{"$f":"Lists!AJ31","v":170000},11.707988980716253]
["Collards or Kale",{"$f":"Lists!AG14","v":"0.25-0.5"},{"$f":"Lists!AH14","v":3},{"$f":"Lists!AI14","v":4},"to 150F",{"$f":"Lists!AJ14","v":175000},12.052341597796143]
["Mustard",{"$f":"Lists!AG17","v":"0.25-0.5"},{"$f":"Lists!AH17","v":3},{"$f":"Lists!AI17","v":4},"to 150F",{"$f":"Lists!AJ17","v":170000},11.707988980716253]
["Flax",{"$f":"Lists!AG13","v":"0.5-1.5"},{"$f":"Lists!AH13","v":15},{"$f":"Lists!AI13","v":18}," 24 to 26o F",{"$f":"Lists!AJ13","v":80000},27.548209366391184]
["Warm Season Broadleaves"]
["Buckwheat",{"$f":"Lists!AG6","v":0.5},{"$f":"Lists!AH6","v":45},{"$f":"Lists!AI6","v":50},"to 320F",{"$f":"Lists!AJ6","v":19500},{"$f":"(C28*F28)/43560","v":20.144628099173552}]
["Sunflower",{"$f":"Lists!AG27","v":"0.75-1.5"},{"$f":"Lists!AH27","v":3},{"$f":"Lists!AI27","v":5},"22 to 250F",{"$f":"Lists!AJ27","v":8000},0.55096418732782371]
["Cool Season Legumes"]
["Hairy Vetch",{"$f":"Lists!AG33","v":"0.5-1.5"},{"$f":"Lists!AH33","v":12},{"$f":"Lists!AI33","v":14},"to -200F",{"$f":"Lists!AJ33","v":12000},{"$f":"(C31*F31)/43560","v":3.3057851239669422}]
["Common Vetch",{"$f":"Lists!AG32","v":"0.5-1.5"},{"$f":"Lists!AH32","v":20},{"$f":"Lists!AI32","v":26},"to 100F",{"$f":"Lists!AJ32","v":8000},3.6730945821854912]
["Crimson Clover",{"$f":"Lists!AG9","v":"0.25-0.5"},{"$f":"Lists!AH9","v":10},{"$f":"Lists!AI9","v":11},"to 100F",{"$f":"Lists!AJ9","v":107000},24.563820018365472]
["Berseem Clover",{"$f":"Lists!AG8","v":"0.25-0.5"},{"$f":"Lists!AH8","v":8},{"$f":"Lists!AI8","v":9},"15 to 200F",{"$f":"Lists!AJ8","v":206880},37.994490358126718]
["Red Clover",{"$f":"Lists!AG10","v":"0.25-0.5"},{"$f":"Lists!AH10","v":8},{"$f":"Lists!AI10","v":10},"to -300F",{"$f":"Lists!AJ10","v":184000},33.792470156106518]
["White Clover",{"$f":"Lists!AG11","v":0.25},{"$f":"Lists!AH11","v":5},{"$f":"Lists!AI11","v":7},"to -400F",{"$f":"Lists!AJ11","v":500000},57.392102846648299]
["Winter Pea",{"$f":"Lists!AG19","v":"1.0-3.0"},{"$f":"Lists!AH19","v":45},{"$f":"Lists!AI19","v":45},"to -100F",{"$f":"Lists!AJ19","v":3200},3.3057851239669422]
["Warm Season Legumes"]
["Cowpea \n(summer pea)",{"$f":"Lists!AG12","v":"0.75-1.0"},{"$f":"Lists!AH12","v":30},{"$f":"Lists!AI12","v":38},"to 320F",{"$f":"Lists!AJ12","v":4000},{"$f":"(C39*F39)/43560","v":2.7548209366391183}]
["Mungbean",{"$f":"Lists!AG16","v":"1.5-3.0"},{"$f":"Lists!AH16","v":15},{"$f":"Lists!AI16","v":18},"to 320F",{"$f":"Lists!AJ16","v":7000},2.4104683195592287]
["Sunn Hemp",{"$f":"Lists!AG28","v":"0.5-1.0"},{"$f":"Lists!AH28","v":15},{"$f":"Lists!AI28","v":22},"to 320F",{"$f":"Lists!AJ28","v":15000},5.1652892561983474]
["* Up to 20% of the seed mix can be other species not listed in the MCCC’s-Cover Crop Decision Tool if approved by the ARC (Area Resource Conservationist). The ARC will determine the lbs. of the species needed to meet the % of seed mix up to the 20% limit.\n\nThe rates listed are for pure stand seedings. When developing a cover crop mix, take the percent desired by the pure stand rate to determine seeding rate by species.\n\nAll seed must be tested for purity and germination by a certified seed lab.  The germination test must be no older than 12 months.\n\nNo species listed as part of Iowa's Noxious Weed list (Iowa Code Chapter 317) are allowed. The only exception would be seed raised and planted on the same farm. \n"]

{"sheet":"Plant Info","index":4,"n_rows":40,"n_cols":14,"rows_kept":40,"cut":false,"hidden":false,"merged":[[27,0,27,12],[35,0,35,12],[39,0,39,13],[0,0,0,13],[2,0,2,13],[3,0,3,12],[10,0,10,12],[16,0,16,12],[24,0,24,12]]}
["Plant Information"]
["Species","Scientific Name","Annual Perennial Biennial","Nutrient Scavenger","Soil Builder","Erosion Protection","Promotes Nitrogen Fixation","Suppress Weeds","Break Compaction Layers","Quick Growth","Supple-mental Grazing","Arbuscular Mycorrhizal Fungal Association","Growth Habit","Comments"]
["E = EXCELLENT     VG = VERY GOOD     G = GOOD     F = FAIR     P = POOR     "]
["Cool Season Grasses"]
["Annual Ryegrass/1","Lolium multiflorum","Annual ","VG","VG","VG","N/A","VG","VG","VG","E","Forms Association","Upright","Recommended for advanced cover crop experience, do NOT use VNS (variety not stated seed).  "]
["Barley \n(Winter or Spring) ","Hordeum vulgare","Annual ","VG","VG","E","N/A","VG","G","VG","VG","Forms Association","Upright"]
["Oats","Avena sativa","Annual ","VG","VG","VG","N/A","VG","G","E","E","Forms Association","Upright"]
["Cereal Rye","Secale cereale","Annual ","E","E","E","N/A","E","VG","E","E","Forms Association","Upright","Winter Cereal Rye is very resilient and can be planted late into the growing season.  "]
["Wheat \n(Winter or Spring)","Triticum aestivum","Annual ","VG","VG","E","N/A","E","G","VG","E","Forms Association","Upright"]
["Triticale ","Triticum x Secale","Annual ","E","E","E","N/A","E","VG","VG","E","Forms Association","Upright"]
["Warm Season Grasses"]
["Forage Sorghum","Sorghum bicolor","Annual ","E","E","VG","N/A","E","VG","VG","E","Forms Association","Upright"]
["Sorghum-Sudangrass","Sorghum sp.","Annual ","E","E","E","N/A","E","VG","VG","E","Forms Association","Upright"]
["Sudangrass",null,"Annual","E","E","E","N/A","E",null,"VG","E","Forms Association","Upright"]
["Teff","Eragrostis tef","A","G","G","G","N/A","G","G","G","VG","Forms Association","Upright"]
["Millets",null,"Annual ","E","E","VG","N/A","VG","G","E","E","Forms Association","Upright"]
["Cool Season Broadleaves"]
["Canola/Rapeseed","Brassica napus","Annual or Biennial","VG","G","VG","N/A","VG","G","VG","G","No Association","Upright","Great spring flowering for pollinators."]
["Camelina","Camelina sativa ","Winter Annual","G","G","G","N/A","F","G","G","F","No Association","Upright"]
["Radish",null,"Annual","E","VG","VG","N/A","E","VG","E","G","No Association","Upright","May have the ability to break soil borne pests or pathogens"]
["Turnip","Brassica rapa","Biennial","VG","G","G","N/A","VG","G","G","E","No Association","Upright"]
["Collards or Kale","Brassica sp.","Annual","VG","G","G","N/A","VG","G","G","VG","No Association","Upright"]
["Mustard","Brassica sp.","Annual or Perennial","G","VG","VG","N/A","VG","G","VG","F","No Association","Upright","May have the ability to break soil borne pests or pathogens"]
["Flax","Linum usitatissimum","Annual","VG","F","F","N/A","G","F","P","P","Forms Association","Upright"]
["Warm Season Broadleaves"]
["Buckwheat","Fagopyrum esculentum","Annual","P","G","F","N/A","E","F","E","P","No Association","Semi-upright","Flowering stage is excellent for pollinators."]
["Sunflower","Helianthus annuus","Annual","P","G","F","N/A","F","F","VG","P","Forms Association","Upright","Flowering stage is excellent for pollinators."]
["Cool Season Legumes",null,null,null,null,null,null,null,null,null,null,null,null,"Inoculant Species to Use "]
["Hairy Vetch/1","Vicia villosa","Annual or Biennial","F","VG","G","E","G","F","P","F","Forms Association","Climbing","Rhizobium leguminosarum "]
["Common Vetch","Vicia sativa","Annual","F","VG","G","E","G","F","P","F","Forms Association","Semi-upright","Rhizobium leguminosarum"]
["Crimson Clover","Trifolium incarnatum","Annual","G","VG","VG","VG","VG","F","G","G","Forms Association","Semi-upright","Rhizobium trifolii"]
["Berseem Clover","Trifolium alexandrinum","Annual","VG","VG","VG","E","E","F","G","E","Forms Association","Semi-upright","Rhizobium  trifolii"]
["Red Clover","Trifolium pratense","Perennial","G","VG","G","VG","VG","F","VG","E","Forms Association","Semi-upright","Rhizobium trifolii"]
["White Clover","Trifolium repens","Perennial","F","G","VG","E","VG","F","P","VG","Forms Association","Prostrate","Rhizobium  trifolii"]
["Winter Pea","Pisum sativum","Annual","F","G","VG","E","VG","F","VG","G","Forms Association","Climbing","Rhizobium leguminosarum "]
["Warm Season Legumes",null,null,null,null,null,null,null,null,null,null,null,null,"Inoculant Species to Use "]
["Cowpea \n(summer pea)","Vigna unguiculata","Annual","F","G","E","E","E","F","G","G","Forms Association","Semi-upright","Bradyrhizobium japonicum"]
["Mungbean","Vigna radiata","Annual","F","F","F","G","G","F","G","G","Forms Association","Semi-upright","Bradyrhizobium spp."]
["Sunn Hemp/1","Crotalaria juncea","Annual","G","G","F","G","G","G","VG","F","Forms Association","Upright","Bradyrhizobium japonicum"]
["/1 = These plants may become weedy or invasive in some regions or habitats and may displace desirable vegetation if not properly managed."]

{"sheet":"Mixes","index":5,"n_rows":12,"n_cols":4,"rows_kept":12,"cut":false,"hidden":true,"merged":[[0,0,0,3],[2,0,10,0],[11,0,17,0]]}
["Possible Mixes to Consider (ideas for your use)"]
[null,"Resource Concern/Farmer Goals","Winter Kill Mixes","Mixes Needing Spring Termination"]
["Mixes Before Corn"]
[]
[]
[]
[]
[]
[]
[]
[]
["Mixes Before Soybeans",null,"Winter Kill Mixes","Mixes Needing Spring Termination"]

{"sheet":"Lists","index":6,"n_rows":327,"n_cols":67,"rows_kept":327,"cut":false,"hidden":true,"merged":[[223,1,223,8],[189,5,189,8],[188,1,188,8],[153,1,153,8],[154,5,154,8],[119,1,119,4],[154,1,154,4],[1,35,2,35],[1,31,2,31],[1,32,2,32],[119,5,119,8],[118,1,118,8],[84,5,84,8],[83,1,83,8],[48,1,48,8],[49,1,49,4],[49,5,49,8],[13,1,13,8],[14,1,14,4],[14,5,14,8],[1,37,2,37],[129,11,129,18],[104,15,104,18],[104,11,104,14],[294,1,294,4],[224,1,224,4],[259,1,259,4],[294,5,294,8],[259,5,259,8],[293,1,293,8],[258,1,258,8],[224,5,224,8],[1,36,2,36],[35,31,36,36],[189,1,189,4],[84,1,84,4]]}
[null,null,null,null,null,null,null,null,null,null,null,null,null,null,null,null,"Column1","Column2",null,null,null,null,null,"Fall","Spring","Summer","Interseed",null,"CoverCropSpecies",null,null,"IOWA SEEDING RATES 1/",null,null,null,null,null,null,null,null,null,"Northwest","Northwest",null,"North_Central","North_Central",null,"Northeast","Northeast",null,"West_Central","West_Central",null,"Central","Central",null,"East_Central","East_Central",null,"Southwest","Southwest",null,"South_Central","South_Central",null,"Southeast","Southeast"]
[null,"Click the button for your Zone to show the seeding dates.",null,null,null,null,null,null,null,null,null,null,null,null,null,null,"Select County","Select_County",null,null,null,null,null,"Barley, Spring","Barley, Spring","Barley, Spring","Barley, Spring",null,null,null,null,"Species Common Name","Planting Depth (inches)","Single Species Seeding Rates",null,"approx. seeds per pound","Crop Type","Winter Hardiness",null,null,null,"BUENA VISTA","Northwest",null,"BUTLER","North_Central",null,"ALLAMAKEE","Northeast",null,"AUDUBON","West_Central",null,"BOONE","Central",null,"BENTON","East_Central",null,"ADAIR","Southwest",null,"APPANOOSE","South_Central",null,"DAVIS","Southeast"]
[null,null,null,null,null,null,null,null,null,null,null,null,null,null,null,null,"ADAIR","Southwest",null,null,null,null,null,"Barley, Winter","Buckwheat","Barley, Winter","Buckwheat",null,null,null,null,null,null,"Drilled (lbs/ac)","Broadcast (lbs/ac)",null,null,null,null,null,null,"CHEROKEE","Northwest",null,"CERRO GORDO","North_Central",null,"BLACK HAWK","Northeast",null,"CALHOUN","West_Central",null,"DALLAS","Central",null,"CEDAR","East_Central",null,"ADAMS","Southwest",null,"CLARKE","South_Central",null,"DES MOINES","Southeast"]
[null,null,null,null,null,null,null,null,null,null,null,null,null,null,null,null,"ADAMS","Southwest",null,null,null,null,null,"Buckwheat","Clover, Berseem","Buckwheat","Clover, Berseem",null,null,null,null,"Barley, Spring","0.75-2.0",60,60,18000,"CSG","  to 25 F",null,null,null,"CLAY","Northwest",null,"FLOYD","North_Central",null,"BREMER","Northeast",null,"CARROLL","West_Central",null,"GRUNDY","Central",null,"CLINTON","East_Central",null,"CASS","Southwest",null,"DECATUR","South_Central",null,"HENRY","Southeast"]
[null," ",null,null,null,null,null,null,null,null,null,null,null,null,null,null,"ALLAMAKEE","Northeast",null,null,null,null,null,"Camelina, Winter","Clover, Crimson","Clover, Berseem","Clover, Crimson",null,null,null,null,"Barley, Winter","0.75-2.0",60,60,18000,"CSG","  to 0 F",null,null,null,"DICKINSON","Northwest",null,"FRANKLIN","North_Central",null,"BUCHANAN","Northeast",null,"CRAWFORD","West_Central",null,"HAMILTON","Central",null,"IOWA","East_Central",null,"FREMONT","Southwest",null,"LUCAS","South_Central",null,"JEFFERSON","Southeast"]
[null,null,null,null,null,null,null,null,null,null,null,null,null,null,null,null,"APPANOOSE","South_Central",null,null,null,null,null,"Clover, Berseem","Clover, Red","Clover, Crimson","Clover, Red",null,null,null,null,"Buckwheat",0.5,45,50,19500,"WSB","32 F",null,null,null,"EMMET","Northwest",null,"HANCOCK","North_Central",null,"CHICKASAW","Northeast",null,"GREENE","West_Central",null,"HARDIN","Central",null,"JACKSON","East_Central",null,"MILLS","Southwest",null,"MADISON","South_Central",null,"KEOKUK","Southeast"]
[null,null,null,null,null,null,null,null,null,null,null,null,null,null,null,null,"AUDUBON","West_Central",null,null,null,null,null,"Clover, Crimson","Clover, White","Clover, Red","Clover, White",null,null,null,null,"Camelina, Winter","0.25-0.5",3,4,400000,"CSB","to - 20 F",null,null,null,"LYON","Northwest",null,"HUMBOLDT","North_Central",null,"CLAYTON","Northeast",null,"GUTHRIE","West_Central",null,"JASPER","Central",null,"JOHNSON","East_Central",null,"MONTGOMERY","Southwest",null,"MARION","South_Central",null,"LEE","Southeast"]
[null,null,null,null,null,null,null,null,null,null,null,null,null,null,null,null,"BENTON","East_Central",null,null,null,null,null,"Clover, Red","Flax","Clover, White","Cowpea",null,null,null,null,"Clover, Berseem","0.25-0.5",8,9,206880,"CSB-L","to 15 F",null,null,null,"OBRIEN","Northwest",null,"KOSSUTH","North_Central",null,"DELAWARE","Northeast",null,"HARRISON","West_Central",null,"MARSHALL","Central",null,"JONES","East_Central",null,"PAGE","Southwest",null,"MONROE","South_Central",null,"LOUISA","Southeast"]
[null,null,null,null,null,null,null,null,null,null,null,null,null,null,null,null,"BLACK HAWK","Northeast",null,null,null,null,null,"Clover, White","Kale","Cowpea","Flax",null,null,null,null,"Clover, Crimson","0.25-0.5",10,11,107000,"CSB-L","to 10 F",null,null,null,"OSCEOLA","Northwest",null,"MITCHELL","North_Central",null,"DUBUQUE","Northeast",null,"IDA","West_Central",null,"POLK","Central",null,"LINN","East_Central",null,"POTTAWATTAMIE","Southwest",null,"RINGGOLD","South_Central",null,"MAHASKA","Southeast"]
[null,null,null,null,null,null,null,null,null,null,null,null,null,null,null,null,"BOONE","Central",null,null,null,null,null,"Flax","Mustard","Flax","Kale",null,null,null,null,"Clover, Red","0.25-0.5",8,10,184000,"CSB-L","to - 30 F",null,null,null,"PALO ALTO","Northwest",null,"WINNEBAGO","North_Central",null,"FAYETTE","Northeast",null,"MONONA","West_Central",null,"POWESHIEK","Central",null,"MUSCATINE","East_Central",null,"TAYLOR","Southwest",null,"UNION","South_Central",null,"VAN BUREN","Southeast"]
[null,null,null,null,null,null,null,null,null,null,null,null,null,null,null,null,"BREMER","Northeast",null,null,null,null,null,"Kale","Oats","Kale","Millet",null,null,null,null,"Clover, White",0.25,5,7,500000,"CSB-L","to - 40 F",null,null,null,"PLYMOUTH","Northwest",null,"WORTH","North_Central",null,"HOWARD","Northeast",null,"SAC","West_Central",null,"STORY","Central",null,"SCOTT","East_Central",null,null,null,null,"WARREN","South_Central",null,"WAPELLO","Southeast"]
[null,null,null,null,null,null,null,null,null,null,null,null,null,null,null,null,"BUCHANAN","Northeast",null,null,null,null,null,"Mustard","Pea, Field/Winter","Millet","Mungbeans",null,null,null,null,"Cowpea","0.75-1.0",30,38,4000,"WSB-L","32 F",null,null,null,"POCAHONTAS","Northwest",null,"WRIGHT","North_Central",null,"WINNESHIEK","Northeast",null,"SHELBY","West_Central",null,"TAMA","Central",null,null,null,null,null,null,null,"WAYNE","South_Central",null,"WASHINGTON","Southeast"]
[null,null,null,null,null,null,null,null,null,null,null,null,null,null,null,null,"BUENA VISTA","Northwest",null,null,null,null,null,"Oats","Radish","Mungbeans","Mustard",null,null,null,null,"Flax","0.5-1.5",15,18,80000,"CSB"," 24 to 26 F",null,null,null,"SIOUX","Northwest",null,null,null,null,null,null,null,"WOODBURY","West_Central",null,"WEBSTER","Central"]
["Species","Northwest",null,null,null,null,null,null,null,null,null,null,null,null,null,null,"BUTLER","North_Central",null,null,null,null,null,"Pea, Field/Winter","Rapeseed","Mustard","Oats",null,null,null,null,"Kale","0.25-0.5",3,4,175000,"CSB"," to 15 F"]
[null,"Spring/Interseed/Summer",null,null,null,"Fall",null,null,null,null,null,null,null,null,null,null,"CALHOUN","West_Central",null,null,null,null,null,"Radish","Ryegrass, Annual","Oats","Radish",null,null,null,null,"Millet","0.5-1.0",10,12,80000,"WSG","32 F"]
["Barley, Spring","2021-03-23","2021-04-07","2021-05-04","2021-05-29","2021-08-06","2021-08-18","2021-09-06","2021-09-18",null,null,null,null,null,null,null,"CARROLL","West_Central",null,null,null,null,null,"Rapeseed","Turnip","Pea, Field/Winter","Rapeseed",null,null,null,null,"Mungbeans","1.5-3.0",15,18,7000,"WSB-L","32 F"]
["Barley, Winter","-","-","-","-","2021-08-06","2021-08-18","2021-09-06","2021-09-18",null,null,null,null,null,null,null,"CASS","Southwest",null,null,null,null,null,"Rye, Winter/Cereal","Vetch, Common","Radish","Rye, Winter/Cereal",null,null,null,null,"Mustard","0.25-0.5",3,4,170000,"CSB","to 15 F"]
["Mungbeans","-","2021-05-17","2021-08-05","-","-","-","-","-",null,null,null,null,null,null,null,"CEDAR","East_Central",null,null,null,null,null,"Ryegrass, Annual","Vetch, Hairy","Rapeseed","Ryegrass, Annual",null,null,null,null,"Oats","1.0-2.0",60,60,15000,"CSG","to 25 F"]
["Buckwheat","-","2021-05-17","2021-09-06","--","--","2021-05-17","2021-09-06","-",null,null,null,null,null,null,null,"CERRO GORDO","North_Central",null,null,null,null,null,"Triticale, Winter","Wheat, Spring","Ryegrass, Annual","Sunn Hemp",null,null,null,null,"Pea, Field/Winter","1.0-3.0",45,45,3200,"CSB-L","to -10 F"]
["Camelina, Winter","-","-","-","-","2021-08-06","2021-08-18","2021-10-17","2021-10-31",null,null,null,null,null,null,null,"CHEROKEE","Northwest",null,null,null,null,null,"Turnip",null,"Sorghum, Forage","Turnip",null,null,null,null,"Radish","0.25-0.5",5,6,34000,"CSB","to 15 F"]
["Clover, Berseem","2021-04-07","2021-04-18","2021-05-23","-","-","2021-08-06","2021-08-24","2021-09-06",null,null,null,null,null,null,null,"CHICKASAW","Northeast",null,null,null,null,null,"Vetch, Common",null,"Sorghum-Sudangrass","Vetch, Common",null,null,null,null,"Rapeseed","0.25-1.0",3,4,175000,"CSB","to 0 F"]
["Clover, Crimson","2021-04-07","2021-04-18","2021-05-23","-","-","2021-08-06","2021-08-24","2021-09-06",null,null,null,null,null,null,null,"CLARKE","South_Central",null,null,null,null,null,"Vetch, Hairy",null,"Sudangrass","Vetch, Hairy",null,null,null,null,"Rye, Winter/Cereal","0.25-2.0",45,45,12000,"CSG","to - 30 F"]
["Clover, Red","2021-03-23","2021-04-07","2021-05-23","-","-","2021-08-06","2021-09-06","2021-09-12",null,null,null,null,null,null,null,"CLAY","Northwest",null,null,null,null,null,"Wheat, Spring",null,"Sunflower",null,null,null,null,null,"Ryegrass, Annual","0.25-0.50",12,14,190000,"CSG","to 0 F"]
["Clover, White","2021-03-23","2021-04-07","2021-05-23","-","-","2021-08-06","2021-09-06","2021-09-12",null,null,null,null,null,null,null,"CLAYTON","Northeast",null,null,null,null,null,"Wheat, Winter",null,"Sunn Hemp",null,null,null,null,null,"Sorghum, Forage","0.75-1.5",15,17,14000,"WSG","32 F"]
["Cowpea","-","2021-05-17","2021-08-05","-","-","-","-","-",null,null,null,null,null,null,null,"CLINTON","East_Central",null,null,null,null,null,null,null,"Teff",null,null,null,null,null,"Sorghum-Sudangrass","0.75-1.5",15,17,20000,"WSG","32 F"]
["Flax","2021-03-23","2021-04-07","2021-05-17","2021-06-05","2021-07-17","2021-08-06","2021-09-06","2021-09-18",null,null,null,null,null,null,null,"CRAWFORD","West_Central",null,null,null,null,null,null,null,"Turnip",null,null,null,null,null,"Sudangrass","0.75-1.6",15,17,20000,"WSG","32 F"]
["Kale","2021-03-23","2021-04-07","2021-05-18","-","2021-07-05","2021-07-24","2021-09-06","2021-09-18",null,null,null,null,null,null,null,"DALLAS","Central",null,null,null,null,null,null,null,"Vetch, Common",null,null,null,null,null,"Sunflower","0.75-1.5",3,5,8000,"WSB","22 to 25 F"]
["Millet","-","2021-05-17","2021-08-05","-","-","-","-","-",null,null,null,null,null,null,null,"DAVIS","Southeast",null,null,null,null,null,null,null,"Vetch, Hairy",null,null,null,null,null,"Sunn Hemp","0.5-1.0",15,22,15000,"WSB-L","32 F"]
["Mustard","2021-03-23","2021-04-07","2021-05-18","-","-","2021-08-06","2021-09-06","2021-09-18",null,null,null,null,null,null,null,"DECATUR","South_Central",null,null,null,null,null,null,null,"Wheat, Spring",null,null,null,null,null,"Teff",0.25,4,5,1000000,"WSG","32 F"]
["Oats","2021-03-23","2021-04-07","2021-05-04",{"$f":"I30","v":"2021-09-18"},{"$f":"B30","v":"2021-03-23"},"2021-08-18","2021-09-06","2021-09-18",null,null,null,null,null,null,null,"DELAWARE","Northeast",null,null,null,null,null,null,null,null,null,null,null,null,null,"Triticale, Winter","1.5-2.0",45,45,11000,"CSG","to -20 F"]
["Pea, Field/Winter","-","2021-04-07","2021-05-23","-","-","2021-08-06","2021-08-24","2021-09-06",null,null,null,null,null,null,null,"DES MOINES","Southeast",null,null,null,null,null,null,null,null,null,null,null,null,null,"Turnip","0.25-0.5",3,4,170000,"CSB","to 10 F"]
["Radish","2021-04-07","--","--",{"$f":"I32","v":"2021-09-18"},{"$f":"B32","v":"2021-04-07"},"2021-08-06","2021-09-06","2021-09-18",null,null,null,null,null,null,null,"DICKINSON","Northwest",null,null,null,null,null,null,null,null,null,null,null,null,null,"Vetch, Common","0.5-1.5",20,26,8000,"CSB-L","to 10 F"]
["Rapeseed","2021-03-23","2021-04-07","2021-05-17",{"$f":"I33","v":"2021-09-18"},{"$f":"B33","v":"2021-03-23"},"2021-08-06","2021-09-06","2021-09-18",null,null,null,null,null,null,null,"DUBUQUE","Northeast",null,null,null,null,null,null,null,null,null,null,null,null,null,"Vetch, Hairy","0.5-1.5",12,14,12000,"CSB-L","to -20 F"]
["Rye, Winter/Cereal","-","-","-","-","2021-08-06","2021-08-18","2021-10-17","2021-10-31",null,null,null,null,null,null,null,"EMMET","Northwest",null,null,null,null,null,null,null,null,null,null,null,null,null,"Wheat, Spring","0.5-1.5",60,66,14000,"CSG","20 to 25 F"]
["Ryegrass, Annual","-","2021-04-07","2021-05-17","2021-06-17","-","2021-07-17","2021-08-17","2021-09-18",null,null,null,null,null,null,null,"FAYETTE","Northeast",null,null,null,null,null,null,null,null,null,null,null,null,null,"Wheat, Winter","0.5-1.5",45,45,14000,"CSG","to -15 F"]
["Sorghum, Forage","-","2021-05-17","2021-08-05","-","-","-","-","-",null,null,null,null,null,null,null,"FLOYD","North_Central",null,null,null,null,null,null,null,null,null,null,null,null,null,"1/         Up to 20% of the seed mix can be other species not listed in the MCCC’s-Cover Crop Decision Tool if approved by the ARC (Area\n Resource Conservationist). The ARC will determine the lbs. of the species needed to meet the % of seed mix up to the 20% limit.\n\nIt is recommended that you plant diverse cover crop mixes. The rates listed are for pure stand seedings. When\n developing a cover crop mix, take the percent desired by the pure stand rate to determine seeding rate by species.\n\nNo species listed as part of Iowa's Noxious Weed list are allowed."]
["Sorghum-sudangrass","-","2021-05-17","2021-08-05","-","-","-","-","-",null,null,null,null,null,null,null,"FRANKLIN","North_Central"]
["Sudangrass","-","2021-05-17","2021-08-05","-","-","-","-","-",null,null,null,null,null,null,null,"FREMONT","Southwest"]
["Sunflower","-","2021-05-04","2021-08-05","2021-08-24","-","-","-","-",null,null,null,null,null,null,null,"GREENE","West_Central"]
["Sunn Hemp","-","2021-05-17","2021-08-05","2021-08-24","-","-","-","-",null,null,null,null,null,null,null,"GRUNDY","Central"]
["Teff","-","2021-05-17","2021-08-05","2021-08-24","-","-","-","-",null,null,null,null,null,null,null,"GUTHRIE","West_Central"]
["Triticale, Winter","-","-","-","-","2021-08-06","2021-08-18","2021-10-17","2021-10-31",null,null,null,null,null,null,null,"HAMILTON","Central"]
["Turnip","2021-04-07","--","--",{"$f":"I43","v":"2021-09-18"},{"$f":"B43","v":"2021-04-07"},"2021-08-06","2021-09-06","2021-09-18",null,null,null,null,null,null,null,"HANCOCK","North_Central"]
["Vetch, Common","-","2021-04-07","2021-05-23","-","-","2021-07-24","2021-08-24","2021-09-06",null,null,null,null,null,null,null,"HARDIN","Central"]
["Vetch, Hairy","-","2021-04-07","2021-06-05","-","-","2021-08-06","2021-09-06","2021-09-12",null,null,null,null,null,null,null,"HARRISON","West_Central"]
["Wheat, Spring","2021-03-23","2021-04-07","2021-05-04","2021-05-29","2021-08-06","2021-08-18","2021-09-06","2021-09-18",null,null,null,null,null,null,null,"HENRY","Southeast"]
["Wheat, Winter","-","-","-","-","2021-08-06","2021-08-18","2021-10-02","2021-10-16",null,null,null,null,null,null,null,"HOWARD","Northeast"]
[null,null,null,null,null,null,null,null,null,null,null,null,null,null,null,null,"HUMBOLDT","North_Central"]
["Species","North Central",null,null,null,null,null,null,null,null,null,null,null,null,null,null,"IDA","West_Central"]
[null,"Spring ",null,null,null,"Fall",null,null,null,null,null,null,null,null,null,null,"IOWA","East_Central"]
["Barley, Spring","2021-03-19","2021-04-03","2021-04-30","2021-05-27","2021-08-07","2021-08-20","2021-09-08","2021-09-22",null,null,null,null,null,null,null,"JACKSON","East_Central"]
["Barley, Winter","-","-","-","-","2021-08-07","2021-08-20","2021-09-08","2021-09-22",null,null,null,null,null,null,null,"JASPER","Central"]
["Mungbeans","-","2021-05-13","2021-08-06","-","-","-","-","-",null,null,null,null,null,null,null,"JEFFERSON","Southeast"]
["Buckwheat","-","2021-05-13","2021-09-08","--","--","2021-05-13","2021-09-08","-",null,null,null,null,null,null,null,"JOHNSON","East_Central"]
["Camelina, Winter","-","-","-","-","2021-08-07","2021-08-20","2021-10-20","2021-11-03",null,null,null,null,null,null,null,"JONES","East_Central"]
["Clover, Berseem","2021-04-03","2021-04-15","2021-05-20","-","-","2021-08-07","2021-08-26","2021-09-08",null,null,null,null,null,null,null,"KEOKUK","Southeast"]
["Clover, Crimson","2021-04-03","2021-04-15","2021-05-20","-","-","2021-08-07","2021-08-26","2021-09-08",null,null,null,null,null,null,null,"KOSSUTH","North_Central"]
["Clover, Red","2021-03-20","2021-04-03","2021-05-20","-","-","2021-08-07","2021-09-08","2021-09-15",null,null,null,null,null,null,null,"LEE","Southeast"]
["Clover, White","2021-03-20","2021-04-03","2021-05-20","-","-","2021-08-07","2021-09-08","2021-09-15",null,null,null,null,null,null,null,"LINN","East_Central"]
["Cowpea","-","2021-05-13","2021-08-06","-","-","-","-","-",null,null,null,null,null,null,null,"LOUISA","Southeast"]
["Flax","2021-03-20","2021-04-03","2021-05-13","2021-06-02","2021-07-17","2021-08-07","2021-09-08","2021-09-22",null,null,null,null,null,null,null,"LUCAS","South_Central"]
["Kale","2021-03-20","2021-04-03","2021-05-15","-","2021-07-04","2021-07-24","2021-09-08","2021-09-22",null,null,null,null,null,null,null,"LYON","Northwest"]
["Millet","-","2021-05-13","2021-08-06","-","-","-","-","-",null,null,null,null,null,null,null,"MADISON","South_Central"]
["Mustard","2021-03-20","2021-04-03","2021-05-15","-","-","2021-08-07","2021-09-08","2021-09-22",null,null,null,null,null,null,null,"MAHASKA","Southeast"]
["Oats","2021-03-19","2021-04-03","2021-04-30",{"$f":"+I65","v":"2021-09-22"},{"$f":"B65","v":"2021-03-19"},"2021-08-20","2021-09-08","2021-09-22",null,null,null,null,null,null,null,"MARION","South_Central"]
["Pea, Field/Winter","-","2021-04-03","2021-05-20","-","-","2021-08-07","2021-08-26","2021-09-08",null,null,null,null,null,null,null,"MARSHALL","Central"]
["Radish","2021-04-03","--","--",{"$f":"+I67","v":"2021-09-22"},{"$f":"B67","v":"2021-04-03"},"2021-08-07","2021-09-08","2021-09-22",null,null,null,null,null,null,null,"MILLS","Southwest"]
["Rapeseed","2021-03-20","2021-04-03","2021-05-13",{"$f":"+I68","v":"2021-09-22"},"2021-03-20","2021-08-07","2021-09-08","2021-09-22",null,null,null,null,null,null,null,"MITCHELL","North_Central"]
["Rye, Winter/Cereal","-","-","-","-","2021-08-07","2021-08-20","2021-10-20","2021-11-03",null,null,null,null,null,null,null,"MONONA","West_Central"]
["Ryegrass, Annual","-","2021-04-03","2021-05-13","2021-06-16","-","2021-07-17","2021-08-19","2021-09-22",null,null,null,null,null,null,null,"MONROE","South_Central"]
["Sorghum, Forage","-","2021-05-13","2021-08-06","-","-","-","-","-",null,null,null,null,null,null,null,"MONTGOMERY","Southwest"]
["Sorghum-sudangrass","-","2021-05-13","2021-08-06","-","-","-","-","-",null,null,null,null,null,null,null,"MUSCATINE","East_Central"]
["Sudangrass","-","2021-05-13","2021-08-06","-","-","-","-","-",null,null,null,null,null,null,null,"OBRIEN","Northwest"]
["Sunflower","-","2021-04-30","2021-08-06","2021-08-26","-","-","-","-",null,null,null,null,null,null,null,"OSCEOLA","Northwest"]
["Sunn Hemp","-","2021-05-13","2021-08-06","2021-08-26","-","-","-","-",null,null,null,null,null,null,null,"PAGE","Southwest"]
["Teff","-","2021-05-13","2021-08-06","2021-08-26","-","-","-","-",null,null,null,null,null,null,null,"PALO ALTO","Northwest"]
["Triticale, Winter","-","-","-","-","2021-08-07","2021-08-20","2021-10-20","2021-11-03",null,null,null,null,null,null,null,"PLYMOUTH","Northwest"]
["Turnip","2021-04-03","--","--",{"$f":"+I78","v":"2021-09-22"},{"$f":"B78","v":"2021-04-03"},"2021-08-07","2021-09-08","2021-09-22",null,null,null,null,null,null,null,"POCAHONTAS","Northwest"]
["Vetch, Common","-","2021-04-03","2021-05-20","-","-","2021-07-24","2021-08-26","2021-09-08",null,null,null,null,null,null,null,"POLK","Central"]
["Vetch, Hairy","-","2021-04-03","2021-06-02","-","-","2021-08-07","2021-09-08","2021-09-15",null,null,null,null,null,null,null,"POTTAWATTAMIE","Southwest"]
["Wheat, Spring","2021-03-19","2021-04-03","2021-04-30","2021-05-27","2021-08-07","2021-08-20","2021-09-08","2021-09-22",null,null,null,null,null,null,null,"POWESHIEK","Central"]
["Wheat, Winter","-","-","-","-","2021-08-07","2021-08-20","2021-10-06","2021-10-19",null,null,null,null,null,null,null,"RINGGOLD","South_Central"]
[null,null,null,null,null,null,null,null,null,null,null,null,null,null,null,null,"SAC","West_Central"]
["Species","Northeast",null,null,null,null,null,null,null,null,null,null,null,null,null,null,"SCOTT","East_Central"]
[null,"Spring ",null,null,null,"Fall",null,null,null,null,null,null,null,null,null,null,"SHELBY","West_Central"]
["Barley, Spring","2021-03-19","2021-04-03","2021-05-02","2021-05-29","2021-08-08","2021-08-21","2021-09-09","2021-09-23",null,null,null,null,null,null,null,"SIOUX","Northwest"]
["Barley, Winter","-","-","-","-","2021-08-08","2021-08-21","2021-09-09","2021-09-23",null,null,null,null,null,null,null,"STORY","Central"]
["Mungbeans","-","2021-05-15","2021-08-07","-","-","-","-","-",null,null,null,null,null,null,null,"TAMA","Central"]
["Buckwheat","-","2021-05-15","2021-09-09","--","--","2021-05-15","2021-09-09","-",null,null,null,null,null,null,null,"TAYLOR","Southwest"]
["Camelina, Winter","-","-","-","-","2021-08-08","2021-08-21","2021-10-20","2021-11-01",null,null,null,null,null,null,null,"UNION","South_Central"]
["Clover, Berseem","2021-04-03","2021-04-16","2021-05-22","-","-","2021-08-08","2021-08-27","2021-09-09",null,null,null,null,null,null,null,"VAN BUREN","Southeast"]
["Clover, Crimson","2021-04-03","2021-04-16","2021-05-22","-","-","2021-08-08","2021-08-27","2021-09-09",null,null,null,null,null,null,null,"WAPELLO","Southeast"]
["Clover, Red","2021-03-20","2021-04-03","2021-05-22","-","-","2021-08-08","2021-09-09","2021-09-16",null,null,null,null,null,null,null,"WARREN","South_Central"]
["Clover, White","2021-03-20","2021-04-03","2021-05-22","-","-","2021-08-08","2021-09-09","2021-09-16",null,null,null,null,null,null,null,"WASHINGTON","Southeast"]
["Cowpea","-","2021-05-15","2021-08-07","-","-","-","-","-",null,null,null,null,null,null,null,"WAYNE","South_Central"]
["Flax","2021-03-20","2021-04-03","2021-05-15","2021-06-04","2021-07-19","2021-08-08","2021-09-09","2021-09-23",null,null,null,null,null,null,null,"WEBSTER","Central"]
["Kale","2021-03-20","2021-04-03","2021-05-17","-","2021-07-06","2021-07-26","2021-09-09","2021-09-23",null,null,null,null,null,null,null,"WINNEBAGO","North_Central"]
["Millet","-","2021-05-15","2021-08-07","-","-","-","-","-",null,null,null,null,null,null,null,"WINNESHIEK","Northeast"]
["Mustard","2021-03-20","2021-04-03","2021-05-17","-","-","2021-08-08","2021-09-09","2021-09-23",null,null,null,null,null,null,null,"WOODBURY","West_Central"]
["Oats","2021-03-19","2021-04-03","2021-05-02",{"$f":"I100","v":"2021-09-23"},{"$f":"B100","v":"2021-03-19"},"2021-08-21","2021-09-09","2021-09-23",null,null,null,null,null,null,null,"WORTH","North_Central"]
["Pea, Field/Winter","-","2021-04-03","2021-05-22","-","-","2021-08-08","2021-08-27","2021-09-09",null,null,null,null,null,null,null,"WRIGHT","North_Central"]
["Radish","2021-04-03","--","--",{"$f":"I102","v":"2021-09-23"},{"$f":"B102","v":"2021-04-03"},"2021-08-08","2021-09-09","2021-09-23"]
["Rapeseed","2021-03-20","2021-04-03","2021-05-15",{"$f":"I103","v":"2021-09-23"},{"$f":"B103","v":"2021-03-20"},"2021-08-08","2021-09-09","2021-09-23"]
["Rye, Winter/Cereal","-","-","-","-","2021-08-08","2021-08-21","2021-10-20","2021-11-01"]
["Ryegrass, Annual","-","2021-04-03","2021-05-15","2021-06-18","-","2021-07-19","2021-08-20","2021-09-23",null,null,"Spring/Interseed/Summer",null,null,null,"Fall"]
["Sorghum, Forage","-","2021-05-15","2021-08-07","-","-","-","-","-",null,null,"Start","Start Prime","End Prime","End","Start","Start Prime","End Prime","End"]
["Sorghum-sudangrass","-","2021-05-15","2021-08-07","-","-","-","-","-",null,{"$f":"+'Seeding Plan'!B36","v":0},{"$f":"IF('Seeding Plan'!$B36=\"\",\"\",IF('Seeding Plan'!$C$8=\"Northwest\",VLOOKUP('Seeding Plan'!$B36,NW_Dates,2,FALSE),IF('Seeding Plan'!$C$8=\"North_Central\",VLOOKUP('Seeding Plan'!$B36,NC_Dates,2,FALSE),IF('Seeding Plan'!$C$8=\"Northeast\",VLOOKUP('Seeding Plan'!$B36,NE_Dates,2,FALSE),IF('Seeding Plan'!$C$8=\"West_Central\",VLOOKUP('Seeding Plan'!$B36,WC_Dates,2,FALSE),IF('Seeding Plan'!$C$8=\"Central\",VLOOKUP('Seeding Plan'!$B36,C_Dates,2,FALSE), IF('Seeding Plan'!$C$8=\"East_Central\",VLOOKUP('Seeding Plan'!$B36,EC_Dates,2,FALSE), IF('Seeding Plan'!$C$8=\"Southwest\",VLOOKUP('Seeding Plan'!$B36,SW_Dates,2,FALSE), IF('Seeding Plan'!$C$8=\"South_Central\",VLOOKUP('Seeding Plan'!$B36,SC_Dates,2,FALSE),IF('Seeding Plan'!$C$8=\"Southeast\",VLOOKUP('Seeding Plan'!$B36,SE_Dates,2,FALSE)))))))))))","v":""},{"$f":"IF('Seeding Plan'!B36=\"\",\"\",IF('Seeding Plan'!$C$8=\"Northwest\",VLOOKUP('Seeding Plan'!$B36,NW_Dates,3,FALSE),IF('Seeding Plan'!$C$8=\"North_Central\",VLOOKUP('Seeding Plan'!$B36,NC_Dates,3,FALSE),IF('Seeding Plan'!$C$8=\"Northeast\",VLOOKUP('Seeding Plan'!$B36,NE_Dates,3,FALSE),IF('Seeding Plan'!$C$8=\"West_Central\",VLOOKUP('Seeding Plan'!$B36,WC_Dates,3,FALSE),IF('Seeding Plan'!$C$8=\"Central\",VLOOKUP('Seeding Plan'!$B36,C_Dates,3,FALSE), IF('Seeding Plan'!$C$8=\"East_Central\",VLOOKUP('Seeding Plan'!$B36,EC_Dates,3,FALSE), IF('Seeding Plan'!$C$8=\"Southwest\",VLOOKUP('Seeding Plan'!$B36,SW_Dates,3,FALSE), IF('Seeding Plan'!$C$8=\"South_Central\",VLOOKUP('Seeding Plan'!$B36,SC_Dates,3,FALSE),IF('Seeding Plan'!$C$8=\"Southeast\",VLOOKUP('Seeding Plan'!$B36,SE_Dates,3,FALSE)))))))))))","v":""},{"$f":"IF('Seeding Plan'!$B36=\"\",\"\",IF('Seeding Plan'!$C$8=\"Northwest\",VLOOKUP('Seeding Plan'!$B36,NW_Dates,4,FALSE),IF('Seeding Plan'!$C$8=\"North_Central\",VLOOKUP('Seeding Plan'!$B36,NC_Dates,4,FALSE),IF('Seeding Plan'!$C$8=\"Northeast\",VLOOKUP('Seeding Plan'!$B36,NE_Dates,4,FALSE),IF('Seeding Plan'!$C$8=\"West_Central\",VLOOKUP('Seeding Plan'!$B36,WC_Dates,4,FALSE),IF('Seeding Plan'!$C$8=\"Central\",VLOOKUP('Seeding Plan'!$B36,C_Dates,4,FALSE), IF('Seeding Plan'!$C$8=\"East_Central\",VLOOKUP('Seeding Plan'!$B36,EC_Dates,4,FALSE), IF('Seeding Plan'!$C$8=\"Southwest\",VLOOKUP('Seeding Plan'!$B36,SW_Dates,4,FALSE), IF('Seeding Plan'!$C$8=\"South_Central\",VLOOKUP('Seeding Plan'!$B36,SC_Dates,4,FALSE),IF('Seeding Plan'!$C$8=\"Southeast\",VLOOKUP('Seeding Plan'!$B36,SE_Dates,4,FALSE)))))))))))","v":""},{"$f":"IF('Seeding Plan'!$B36=\"\",\"\",IF('Seeding Plan'!$C$8=\"Northwest\",VLOOKUP('Seeding Plan'!$B36,NW_Dates,5,FALSE),IF('Seeding Plan'!$C$8=\"North_Central\",VLOOKUP('Seeding Plan'!$B36,NC_Dates,5,FALSE),IF('Seeding Plan'!$C$8=\"Northeast\",VLOOKUP('Seeding Plan'!$B36,NE_Dates,5,FALSE),IF('Seeding Plan'!$C$8=\"West_Central\",VLOOKUP('Seeding Plan'!$B36,WC_Dates,5,FALSE),IF('Seeding Plan'!$C$8=\"Central\",VLOOKUP('Seeding Plan'!$B36,C_Dates,5,FALSE), IF('Seeding Plan'!$C$8=\"East_Central\",VLOOKUP('Seeding Plan'!$B36,EC_Dates,5,FALSE), IF('Seeding Plan'!$C$8=\"Southwest\",VLOOKUP('Seeding Plan'!$B36,SW_Dates,5,FALSE), IF('Seeding Plan'!$C$8=\"South_Central\",VLOOKUP('Seeding Plan'!$B36,SC_Dates,5,FALSE),IF('Seeding Plan'!$C$8=\"Southeast\",VLOOKUP('Seeding Plan'!$B36,SE_Dates,5,FALSE)))))))))))","v":""},{"$f":"IF('Seeding Plan'!$B36=\"\",\"\",IF('Seeding Plan'!$C$8=\"Northwest\",VLOOKUP('Seeding Plan'!$B36,NW_Dates,6,FALSE),IF('Seeding Plan'!$C$8=\"North_Central\",VLOOKUP('Seeding Plan'!$B36,NC_Dates,6,FALSE),IF('Seeding Plan'!$C$8=\"Northeast\",VLOOKUP('Seeding Plan'!$B36,NE_Dates,6,FALSE),IF('Seeding Plan'!$C$8=\"West_Central\",VLOOKUP('Seeding Plan'!$B36,WC_Dates,6,FALSE),IF('Seeding Plan'!$C$8=\"Central\",VLOOKUP('Seeding Plan'!$B36,C_Dates,6,FALSE), IF('Seeding Plan'!$C$8=\"East_Central\",VLOOKUP('Seeding Plan'!$B36,EC_Dates,6,FALSE), IF('Seeding Plan'!$C$8=\"Southwest\",VLOOKUP('Seeding Plan'!$B36,SW_Dates,6,FALSE), IF('Seeding Plan'!$C$8=\"South_Central\",VLOOKUP('Seeding Plan'!$B36,SC_Dates,6,FALSE),IF('Seeding Plan'!$C$8=\"Southeast\",VLOOKUP('Seeding Plan'!$B36,SE_Dates,6,FALSE)))))))))))","v":""},{"$f":"IF('Seeding Plan'!$B36=\"\",\"\",IF('Seeding Plan'!$C$8=\"Northwest\",VLOOKUP('Seeding Plan'!$B36,NW_Dates,7,FALSE),IF('Seeding Plan'!$C$8=\"North_Central\",VLOOKUP('Seeding Plan'!$B36,NC_Dates,7,FALSE),IF('Seeding Plan'!$C$8=\"Northeast\",VLOOKUP('Seeding Plan'!$B36,NE_Dates,7,FALSE),IF('Seeding Plan'!$C$8=\"West_Central\",VLOOKUP('Seeding Plan'!$B36,WC_Dates,7,FALSE),IF('Seeding Plan'!$C$8=\"Central\",VLOOKUP('Seeding Plan'!$B36,C_Dates,7,FALSE), IF('Seeding Plan'!$C$8=\"East_Central\",VLOOKUP('Seeding Plan'!$B36,EC_Dates,7,FALSE), IF('Seeding Plan'!$C$8=\"Southwest\",VLOOKUP('Seeding Plan'!$B36,SW_Dates,7,FALSE), IF('Seeding Plan'!$C$8=\"South_Central\",VLOOKUP('Seeding Plan'!$B36,SC_Dates,7,FALSE),IF('Seeding Plan'!$C$8=\"Southeast\",VLOOKUP('Seeding Plan'!$B36,SE_Dates,7,FALSE)))))))))))","v":""},{"$f":"IF('Seeding Plan'!$B36=\"\",\"\",IF('Seeding Plan'!$C$8=\"Northwest\",VLOOKUP('Seeding Plan'!$B36,NW_Dates,8,FALSE),IF('Seeding Plan'!$C$8=\"North_Central\",VLOOKUP('Seeding Plan'!$B36,NC_Dates,8,FALSE),IF('Seeding Plan'!$C$8=\"Northeast\",VLOOKUP('Seeding Plan'!$B36,NE_Dates,8,FALSE),IF('Seeding Plan'!$C$8=\"West_Central\",VLOOKUP('Seeding Plan'!$B36,WC_Dates,8,FALSE),IF('Seeding Plan'!$C$8=\"Central\",VLOOKUP('Seeding Plan'!$B36,C_Dates,8,FALSE), IF('Seeding Plan'!$C$8=\"East_Central\",VLOOKUP('Seeding Plan'!$B36,EC_Dates,8,FALSE), IF('Seeding Plan'!$C$8=\"Southwest\",VLOOKUP('Seeding Plan'!$B36,SW_Dates,8,FALSE), IF('Seeding Plan'!$C$8=\"South_Central\",VLOOKUP('Seeding Plan'!$B36,SC_Dates,8,FALSE),IF('Seeding Plan'!$C$8=\"Southeast\",VLOOKUP('Seeding Plan'!$B36,SE_Dates,8,FALSE)))))))))))","v":""},{"$f":"IF('Seeding Plan'!$B36=\"\",\"\",IF('Seeding Plan'!$C$8=\"Northwest\",VLOOKUP('Seeding Plan'!$B36,NW_Dates,9,FALSE),IF('Seeding Plan'!$C$8=\"North_Central\",VLOOKUP('Seeding Plan'!$B36,NC_Dates,9,FALSE),IF('Seeding Plan'!$C$8=\"Northeast\",VLOOKUP('Seeding Plan'!$B36,NE_Dates,9,FALSE),IF('Seeding Plan'!$C$8=\"West_Central\",VLOOKUP('Seeding Plan'!$B36,WC_Dates,9,FALSE),IF('Seeding Plan'!$C$8=\"Central\",VLOOKUP('Seeding Plan'!$B36,C_Dates,9,FALSE), IF('Seeding Plan'!$C$8=\"East_Central\",VLOOKUP('Seeding Plan'!$B36,EC_Dates,9,FALSE), IF('Seeding Plan'!$C$8=\"Southwest\",VLOOKUP('Seeding Plan'!$B36,SW_Dates,9,FALSE), IF('Seeding Plan'!$C$8=\"South_Central\",VLOOKUP('Seeding Plan'!$B36,SC_Dates,9,FALSE),IF('Seeding Plan'!$C$8=\"Southeast\",VLOOKUP('Seeding Plan'!$B36,SE_Dates,9,FALSE)))))))))))","v":""}]
["Sudangrass","-","2021-05-15","2021-08-07","-","-","-","-","-",null,{"$f":"+'Seeding Plan'!B37","v":0},{"$f":"IF('Seeding Plan'!$B37=\"\",\"\",IF('Seeding Plan'!$C$8=\"Northwest\",VLOOKUP('Seeding Plan'!$B37,NW_Dates,2,FALSE),IF('Seeding Plan'!$C$8=\"North_Central\",VLOOKUP('Seeding Plan'!$B37,NC_Dates,2,FALSE),IF('Seeding Plan'!$C$8=\"Northeast\",VLOOKUP('Seeding Plan'!$B37,NE_Dates,2,FALSE),IF('Seeding Plan'!$C$8=\"West_Central\",VLOOKUP('Seeding Plan'!$B37,WC_Dates,2,FALSE),IF('Seeding Plan'!$C$8=\"Central\",VLOOKUP('Seeding Plan'!$B37,C_Dates,2,FALSE), IF('Seeding Plan'!$C$8=\"East_Central\",VLOOKUP('Seeding Plan'!$B37,EC_Dates,2,FALSE), IF('Seeding Plan'!$C$8=\"Southwest\",VLOOKUP('Seeding Plan'!$B37,SW_Dates,2,FALSE), IF('Seeding Plan'!$C$8=\"South_Central\",VLOOKUP('Seeding Plan'!$B37,SC_Dates,2,FALSE),IF('Seeding Plan'!$C$8=\"Southeast\",VLOOKUP('Seeding Plan'!$B37,SE_Dates,2,FALSE)))))))))))","v":""},{"$f":"IF('Seeding Plan'!B37=\"\",\"\",IF('Seeding Plan'!$C$8=\"Northwest\",VLOOKUP('Seeding Plan'!$B37,NW_Dates,3,FALSE),IF('Seeding Plan'!$C$8=\"North_Central\",VLOOKUP('Seeding Plan'!$B37,NC_Dates,3,FALSE),IF('Seeding Plan'!$C$8=\"Northeast\",VLOOKUP('Seeding Plan'!$B37,NE_Dates,3,FALSE),IF('Seeding Plan'!$C$8=\"West_Central\",VLOOKUP('Seeding Plan'!$B37,WC_Dates,3,FALSE),IF('Seeding Plan'!$C$8=\"Central\",VLOOKUP('Seeding Plan'!$B37,C_Dates,3,FALSE), IF('Seeding Plan'!$C$8=\"East_Central\",VLOOKUP('Seeding Plan'!$B37,EC_Dates,3,FALSE), IF('Seeding Plan'!$C$8=\"Southwest\",VLOOKUP('Seeding Plan'!$B37,SW_Dates,3,FALSE), IF('Seeding Plan'!$C$8=\"South_Central\",VLOOKUP('Seeding Plan'!$B37,SC_Dates,3,FALSE),IF('Seeding Plan'!$C$8=\"Southeast\",VLOOKUP('Seeding Plan'!$B37,SE_Dates,3,FALSE)))))))))))","v":""},{"$f":"IF('Seeding Plan'!$B37=\"\",\"\",IF('Seeding Plan'!$C$8=\"Northwest\",VLOOKUP('Seeding Plan'!$B37,NW_Dates,4,FALSE),IF('Seeding Plan'!$C$8=\"North_Central\",VLOOKUP('Seeding Plan'!$B37,NC_Dates,4,FALSE),IF('Seeding Plan'!$C$8=\"Northeast\",VLOOKUP('Seeding Plan'!$B37,NE_Dates,4,FALSE),IF('Seeding Plan'!$C$8=\"West_Central\",VLOOKUP('Seeding Plan'!$B37,WC_Dates,4,FALSE),IF('Seeding Plan'!$C$8=\"Central\",VLOOKUP('Seeding Plan'!$B37,C_Dates,4,FALSE), IF('Seeding Plan'!$C$8=\"East_Central\",VLOOKUP('Seeding Plan'!$B37,EC_Dates,4,FALSE), IF('Seeding Plan'!$C$8=\"Southwest\",VLOOKUP('Seeding Plan'!$B37,SW_Dates,4,FALSE), IF('Seeding Plan'!$C$8=\"South_Central\",VLOOKUP('Seeding Plan'!$B37,SC_Dates,4,FALSE),IF('Seeding Plan'!$C$8=\"Southeast\",VLOOKUP('Seeding Plan'!$B37,SE_Dates,4,FALSE)))))))))))","v":""},{"$f":"IF('Seeding Plan'!$B37=\"\",\"\",IF('Seeding Plan'!$C$8=\"Northwest\",VLOOKUP('Seeding Plan'!$B37,NW_Dates,5,FALSE),IF('Seeding Plan'!$C$8=\"North_Central\",VLOOKUP('Seeding Plan'!$B37,NC_Dates,5,FALSE),IF('Seeding Plan'!$C$8=\"Northeast\",VLOOKUP('Seeding Plan'!$B37,NE_Dates,5,FALSE),IF('Seeding Plan'!$C$8=\"West_Central\",VLOOKUP('Seeding Plan'!$B37,WC_Dates,5,FALSE),IF('Seeding Plan'!$C$8=\"Central\",VLOOKUP('Seeding Plan'!$B37,C_Dates,5,FALSE), IF('Seeding Plan'!$C$8=\"East_Central\",VLOOKUP('Seeding Plan'!$B37,EC_Dates,5,FALSE), IF('Seeding Plan'!$C$8=\"Southwest\",VLOOKUP('Seeding Plan'!$B37,SW_Dates,5,FALSE), IF('Seeding Plan'!$C$8=\"South_Central\",VLOOKUP('Seeding Plan'!$B37,SC_Dates,5,FALSE),IF('Seeding Plan'!$C$8=\"Southeast\",VLOOKUP('Seeding Plan'!$B37,SE_Dates,5,FALSE)))))))))))","v":""},{"$f":"IF('Seeding Plan'!$B37=\"\",\"\",IF('Seeding Plan'!$C$8=\"Northwest\",VLOOKUP('Seeding Plan'!$B37,NW_Dates,6,FALSE),IF('Seeding Plan'!$C$8=\"North_Central\",VLOOKUP('Seeding Plan'!$B37,NC_Dates,6,FALSE),IF('Seeding Plan'!$C$8=\"Northeast\",VLOOKUP('Seeding Plan'!$B37,NE_Dates,6,FALSE),IF('Seeding Plan'!$C$8=\"West_Central\",VLOOKUP('Seeding Plan'!$B37,WC_Dates,6,FALSE),IF('Seeding Plan'!$C$8=\"Central\",VLOOKUP('Seeding Plan'!$B37,C_Dates,6,FALSE), IF('Seeding Plan'!$C$8=\"East_Central\",VLOOKUP('Seeding Plan'!$B37,EC_Dates,6,FALSE), IF('Seeding Plan'!$C$8=\"Southwest\",VLOOKUP('Seeding Plan'!$B37,SW_Dates,6,FALSE), IF('Seeding Plan'!$C$8=\"South_Central\",VLOOKUP('Seeding Plan'!$B37,SC_Dates,6,FALSE),IF('Seeding Plan'!$C$8=\"Southeast\",VLOOKUP('Seeding Plan'!$B37,SE_Dates,6,FALSE)))))))))))","v":""},{"$f":"IF('Seeding Plan'!$B37=\"\",\"\",IF('Seeding Plan'!$C$8=\"Northwest\",VLOOKUP('Seeding Plan'!$B37,NW_Dates,7,FALSE),IF('Seeding Plan'!$C$8=\"North_Central\",VLOOKUP('Seeding Plan'!$B37,NC_Dates,7,FALSE),IF('Seeding Plan'!$C$8=\"Northeast\",VLOOKUP('Seeding Plan'!$B37,NE_Dates,7,FALSE),IF('Seeding Plan'!$C$8=\"West_Central\",VLOOKUP('Seeding Plan'!$B37,WC_Dates,7,FALSE),IF('Seeding Plan'!$C$8=\"Central\",VLOOKUP('Seeding Plan'!$B37,C_Dates,7,FALSE), IF('Seeding Plan'!$C$8=\"East_Central\",VLOOKUP('Seeding Plan'!$B37,EC_Dates,7,FALSE), IF('Seeding Plan'!$C$8=\"Southwest\",VLOOKUP('Seeding Plan'!$B37,SW_Dates,7,FALSE), IF('Seeding Plan'!$C$8=\"South_Central\",VLOOKUP('Seeding Plan'!$B37,SC_Dates,7,FALSE),IF('Seeding Plan'!$C$8=\"Southeast\",VLOOKUP('Seeding Plan'!$B37,SE_Dates,7,FALSE)))))))))))","v":""},{"$f":"IF('Seeding Plan'!$B37=\"\",\"\",IF('Seeding Plan'!$C$8=\"Northwest\",VLOOKUP('Seeding Plan'!$B37,NW_Dates,8,FALSE),IF('Seeding Plan'!$C$8=\"North_Central\",VLOOKUP('Seeding Plan'!$B37,NC_Dates,8,FALSE),IF('Seeding Plan'!$C$8=\"Northeast\",VLOOKUP('Seeding Plan'!$B37,NE_Dates,8,FALSE),IF('Seeding Plan'!$C$8=\"West_Central\",VLOOKUP('Seeding Plan'!$B37,WC_Dates,8,FALSE),IF('Seeding Plan'!$C$8=\"Central\",VLOOKUP('Seeding Plan'!$B37,C_Dates,8,FALSE), IF('Seeding Plan'!$C$8=\"East_Central\",VLOOKUP('Seeding Plan'!$B37,EC_Dates,8,FALSE), IF('Seeding Plan'!$C$8=\"Southwest\",VLOOKUP('Seeding Plan'!$B37,SW_Dates,8,FALSE), IF('Seeding Plan'!$C$8=\"South_Central\",VLOOKUP('Seeding Plan'!$B37,SC_Dates,8,FALSE),IF('Seeding Plan'!$C$8=\"Southeast\",VLOOKUP('Seeding Plan'!$B37,SE_Dates,8,FALSE)))))))))))","v":""},{"$f":"IF('Seeding Plan'!$B37=\"\",\"\",IF('Seeding Plan'!$C$8=\"Northwest\",VLOOKUP('Seeding Plan'!$B37,NW_Dates,9,FALSE),IF('Seeding Plan'!$C$8=\"North_Central\",VLOOKUP('Seeding Plan'!$B37,NC_Dates,9,FALSE),IF('Seeding Plan'!$C$8=\"Northeast\",VLOOKUP('Seeding Plan'!$B37,NE_Dates,9,FALSE),IF('Seeding Plan'!$C$8=\"West_Central\",VLOOKUP('Seeding Plan'!$B37,WC_Dates,9,FALSE),IF('Seeding Plan'!$C$8=\"Central\",VLOOKUP('Seeding Plan'!$B37,C_Dates,9,FALSE), IF('Seeding Plan'!$C$8=\"East_Central\",VLOOKUP('Seeding Plan'!$B37,EC_Dates,9,FALSE), IF('Seeding Plan'!$C$8=\"Southwest\",VLOOKUP('Seeding Plan'!$B37,SW_Dates,9,FALSE), IF('Seeding Plan'!$C$8=\"South_Central\",VLOOKUP('Seeding Plan'!$B37,SC_Dates,9,FALSE),IF('Seeding Plan'!$C$8=\"Southeast\",VLOOKUP('Seeding Plan'!$B37,SE_Dates,9,FALSE)))))))))))","v":""}]
["Sunflower","-","2021-05-02","2021-08-07","2021-08-27","-","-","-","-",null,{"$f":"+'Seeding Plan'!B38","v":0},{"$f":"IF('Seeding Plan'!$B38=\"\",\"\",IF('Seeding Plan'!$C$8=\"Northwest\",VLOOKUP('Seeding Plan'!$B38,NW_Dates,2,FALSE),IF('Seeding Plan'!$C$8=\"North_Central\",VLOOKUP('Seeding Plan'!$B38,NC_Dates,2,FALSE),IF('Seeding Plan'!$C$8=\"Northeast\",VLOOKUP('Seeding Plan'!$B38,NE_Dates,2,FALSE),IF('Seeding Plan'!$C$8=\"West_Central\",VLOOKUP('Seeding Plan'!$B38,WC_Dates,2,FALSE),IF('Seeding Plan'!$C$8=\"Central\",VLOOKUP('Seeding Plan'!$B38,C_Dates,2,FALSE), IF('Seeding Plan'!$C$8=\"East_Central\",VLOOKUP('Seeding Plan'!$B38,EC_Dates,2,FALSE), IF('Seeding Plan'!$C$8=\"Southwest\",VLOOKUP('Seeding Plan'!$B38,SW_Dates,2,FALSE), IF('Seeding Plan'!$C$8=\"South_Central\",VLOOKUP('Seeding Plan'!$B38,SC_Dates,2,FALSE),IF('Seeding Plan'!$C$8=\"Southeast\",VLOOKUP('Seeding Plan'!$B38,SE_Dates,2,FALSE)))))))))))","v":""},{"$f":"IF('Seeding Plan'!B38=\"\",\"\",IF('Seeding Plan'!$C$8=\"Northwest\",VLOOKUP('Seeding Plan'!$B38,NW_Dates,3,FALSE),IF('Seeding Plan'!$C$8=\"North_Central\",VLOOKUP('Seeding Plan'!$B38,NC_Dates,3,FALSE),IF('Seeding Plan'!$C$8=\"Northeast\",VLOOKUP('Seeding Plan'!$B38,NE_Dates,3,FALSE),IF('Seeding Plan'!$C$8=\"West_Central\",VLOOKUP('Seeding Plan'!$B38,WC_Dates,3,FALSE),IF('Seeding Plan'!$C$8=\"Central\",VLOOKUP('Seeding Plan'!$B38,C_Dates,3,FALSE), IF('Seeding Plan'!$C$8=\"East_Central\",VLOOKUP('Seeding Plan'!$B38,EC_Dates,3,FALSE), IF('Seeding Plan'!$C$8=\"Southwest\",VLOOKUP('Seeding Plan'!$B38,SW_Dates,3,FALSE), IF('Seeding Plan'!$C$8=\"South_Central\",VLOOKUP('Seeding Plan'!$B38,SC_Dates,3,FALSE),IF('Seeding Plan'!$C$8=\"Southeast\",VLOOKUP('Seeding Plan'!$B38,SE_Dates,3,FALSE)))))))))))","v":""},{"$f":"IF('Seeding Plan'!$B38=\"\",\"\",IF('Seeding Plan'!$C$8=\"Northwest\",VLOOKUP('Seeding Plan'!$B38,NW_Dates,4,FALSE),IF('Seeding Plan'!$C$8=\"North_Central\",VLOOKUP('Seeding Plan'!$B38,NC_Dates,4,FALSE),IF('Seeding Plan'!$C$8=\"Northeast\",VLOOKUP('Seeding Plan'!$B38,NE_Dates,4,FALSE),IF('Seeding Plan'!$C$8=\"West_Central\",VLOOKUP('Seeding Plan'!$B38,WC_Dates,4,FALSE),IF('Seeding Plan'!$C$8=\"Central\",VLOOKUP('Seeding Plan'!$B38,C_Dates,4,FALSE), IF('Seeding Plan'!$C$8=\"East_Central\",VLOOKUP('Seeding Plan'!$B38,EC_Dates,4,FALSE), IF('Seeding Plan'!$C$8=\"Southwest\",VLOOKUP('Seeding Plan'!$B38,SW_Dates,4,FALSE), IF('Seeding Plan'!$C$8=\"South_Central\",VLOOKUP('Seeding Plan'!$B38,SC_Dates,4,FALSE),IF('Seeding Plan'!$C$8=\"Southeast\",VLOOKUP('Seeding Plan'!$B38,SE_Dates,4,FALSE)))))))))))","v":""},{"$f":"IF('Seeding Plan'!$B38=\"\",\"\",IF('Seeding Plan'!$C$8=\"Northwest\",VLOOKUP('Seeding Plan'!$B38,NW_Dates,5,FALSE),IF('Seeding Plan'!$C$8=\"North_Central\",VLOOKUP('Seeding Plan'!$B38,NC_Dates,5,FALSE),IF('Seeding Plan'!$C$8=\"Northeast\",VLOOKUP('Seeding Plan'!$B38,NE_Dates,5,FALSE),IF('Seeding Plan'!$C$8=\"West_Central\",VLOOKUP('Seeding Plan'!$B38,WC_Dates,5,FALSE),IF('Seeding Plan'!$C$8=\"Central\",VLOOKUP('Seeding Plan'!$B38,C_Dates,5,FALSE), IF('Seeding Plan'!$C$8=\"East_Central\",VLOOKUP('Seeding Plan'!$B38,EC_Dates,5,FALSE), IF('Seeding Plan'!$C$8=\"Southwest\",VLOOKUP('Seeding Plan'!$B38,SW_Dates,5,FALSE), IF('Seeding Plan'!$C$8=\"South_Central\",VLOOKUP('Seeding Plan'!$B38,SC_Dates,5,FALSE),IF('Seeding Plan'!$C$8=\"Southeast\",VLOOKUP('Seeding Plan'!$B38,SE_Dates,5,FALSE)))))))))))","v":""},{"$f":"IF('Seeding Plan'!$B38=\"\",\"\",IF('Seeding Plan'!$C$8=\"Northwest\",VLOOKUP('Seeding Plan'!$B38,NW_Dates,6,FALSE),IF('Seeding Plan'!$C$8=\"North_Central\",VLOOKUP('Seeding Plan'!$B38,NC_Dates,6,FALSE),IF('Seeding Plan'!$C$8=\"Northeast\",VLOOKUP('Seeding Plan'!$B38,NE_Dates,6,FALSE),IF('Seeding Plan'!$C$8=\"West_Central\",VLOOKUP('Seeding Plan'!$B38,WC_Dates,6,FALSE),IF('Seeding Plan'!$C$8=\"Central\",VLOOKUP('Seeding Plan'!$B38,C_Dates,6,FALSE), IF('Seeding Plan'!$C$8=\"East_Central\",VLOOKUP('Seeding Plan'!$B38,EC_Dates,6,FALSE), IF('Seeding Plan'!$C$8=\"Southwest\",VLOOKUP('Seeding Plan'!$B38,SW_Dates,6,FALSE), IF('Seeding Plan'!$C$8=\"South_Central\",VLOOKUP('Seeding Plan'!$B38,SC_Dates,6,FALSE),IF('Seeding Plan'!$C$8=\"Southeast\",VLOOKUP('Seeding Plan'!$B38,SE_Dates,6,FALSE)))))))))))","v":""},{"$f":"IF('Seeding Plan'!$B38=\"\",\"\",IF('Seeding Plan'!$C$8=\"Northwest\",VLOOKUP('Seeding Plan'!$B38,NW_Dates,7,FALSE),IF('Seeding Plan'!$C$8=\"North_Central\",VLOOKUP('Seeding Plan'!$B38,NC_Dates,7,FALSE),IF('Seeding Plan'!$C$8=\"Northeast\",VLOOKUP('Seeding Plan'!$B38,NE_Dates,7,FALSE),IF('Seeding Plan'!$C$8=\"West_Central\",VLOOKUP('Seeding Plan'!$B38,WC_Dates,7,FALSE),IF('Seeding Plan'!$C$8=\"Central\",VLOOKUP('Seeding Plan'!$B38,C_Dates,7,FALSE), IF('Seeding Plan'!$C$8=\"East_Central\",VLOOKUP('Seeding Plan'!$B38,EC_Dates,7,FALSE), IF('Seeding Plan'!$C$8=\"Southwest\",VLOOKUP('Seeding Plan'!$B38,SW_Dates,7,FALSE), IF('Seeding Plan'!$C$8=\"South_Central\",VLOOKUP('Seeding Plan'!$B38,SC_Dates,7,FALSE),IF('Seeding Plan'!$C$8=\"Southeast\",VLOOKUP('Seeding Plan'!$B38,SE_Dates,7,FALSE)))))))))))","v":""},{"$f":"IF('Seeding Plan'!$B38=\"\",\"\",IF('Seeding Plan'!$C$8=\"Northwest\",VLOOKUP('Seeding Plan'!$B38,NW_Dates,8,FALSE),IF('Seeding Plan'!$C$8=\"North_Central\",VLOOKUP('Seeding Plan'!$B38,NC_Dates,8,FALSE),IF('Seeding Plan'!$C$8=\"Northeast\",VLOOKUP('Seeding Plan'!$B38,NE_Dates,8,FALSE),IF('Seeding Plan'!$C$8=\"West_Central\",VLOOKUP('Seeding Plan'!$B38,WC_Dates,8,FALSE),IF('Seeding Plan'!$C$8=\"Central\",VLOOKUP('Seeding Plan'!$B38,C_Dates,8,FALSE), IF('Seeding Plan'!$C$8=\"East_Central\",VLOOKUP('Seeding Plan'!$B38,EC_Dates,8,FALSE), IF('Seeding Plan'!$C$8=\"Southwest\",VLOOKUP('Seeding Plan'!$B38,SW_Dates,8,FALSE), IF('Seeding Plan'!$C$8=\"South_Central\",VLOOKUP('Seeding Plan'!$B38,SC_Dates,8,FALSE),IF('Seeding Plan'!$C$8=\"Southeast\",VLOOKUP('Seeding Plan'!$B38,SE_Dates,8,FALSE)))))))))))","v":""},{"$f":"IF('Seeding Plan'!$B38=\"\",\"\",IF('Seeding Plan'!$C$8=\"Northwest\",VLOOKUP('Seeding Plan'!$B38,NW_Dates,9,FALSE),IF('Seeding Plan'!$C$8=\"North_Central\",VLOOKUP('Seeding Plan'!$B38,NC_Dates,9,FALSE),IF('Seeding Plan'!$C$8=\"Northeast\",VLOOKUP('Seeding Plan'!$B38,NE_Dates,9,FALSE),IF('Seeding Plan'!$C$8=\"West_Central\",VLOOKUP('Seeding Plan'!$B38,WC_Dates,9,FALSE),IF('Seeding Plan'!$C$8=\"Central\",VLOOKUP('Seeding Plan'!$B38,C_Dates,9,FALSE), IF('Seeding Plan'!$C$8=\"East_Central\",VLOOKUP('Seeding Plan'!$B38,EC_Dates,9,FALSE), IF('Seeding Plan'!$C$8=\"Southwest\",VLOOKUP('Seeding Plan'!$B38,SW_Dates,9,FALSE), IF('Seeding Plan'!$C$8=\"South_Central\",VLOOKUP('Seeding Plan'!$B38,SC_Dates,9,FALSE),IF('Seeding Plan'!$C$8=\"Southeast\",VLOOKUP('Seeding Plan'!$B38,SE_Dates,9,FALSE)))))))))))","v":""}]
["Sunn Hemp","-","2021-05-15","2021-08-07","2021-08-27","-","-","-","-",null,{"$f":"+'Seeding Plan'!B39","v":0},{"$f":"IF('Seeding Plan'!$B39=\"\",\"\",IF('Seeding Plan'!$C$8=\"Northwest\",VLOOKUP('Seeding Plan'!$B39,NW_Dates,2,FALSE),IF('Seeding Plan'!$C$8=\"North_Central\",VLOOKUP('Seeding Plan'!$B39,NC_Dates,2,FALSE),IF('Seeding Plan'!$C$8=\"Northeast\",VLOOKUP('Seeding Plan'!$B39,NE_Dates,2,FALSE),IF('Seeding Plan'!$C$8=\"West_Central\",VLOOKUP('Seeding Plan'!$B39,WC_Dates,2,FALSE),IF('Seeding Plan'!$C$8=\"Central\",VLOOKUP('Seeding Plan'!$B39,C_Dates,2,FALSE), IF('Seeding Plan'!$C$8=\"East_Central\",VLOOKUP('Seeding Plan'!$B39,EC_Dates,2,FALSE), IF('Seeding Plan'!$C$8=\"Southwest\",VLOOKUP('Seeding Plan'!$B39,SW_Dates,2,FALSE), IF('Seeding Plan'!$C$8=\"South_Central\",VLOOKUP('Seeding Plan'!$B39,SC_Dates,2,FALSE),IF('Seeding Plan'!$C$8=\"Southeast\",VLOOKUP('Seeding Plan'!$B39,SE_Dates,2,FALSE)))))))))))","v":""},{"$f":"IF('Seeding Plan'!B39=\"\",\"\",IF('Seeding Plan'!$C$8=\"Northwest\",VLOOKUP('Seeding Plan'!$B39,NW_Dates,3,FALSE),IF('Seeding Plan'!$C$8=\"North_Central\",VLOOKUP('Seeding Plan'!$B39,NC_Dates,3,FALSE),IF('Seeding Plan'!$C$8=\"Northeast\",VLOOKUP('Seeding Plan'!$B39,NE_Dates,3,FALSE),IF('Seeding Plan'!$C$8=\"West_Central\",VLOOKUP('Seeding Plan'!$B39,WC_Dates,3,FALSE),IF('Seeding Plan'!$C$8=\"Central\",VLOOKUP('Seeding Plan'!$B39,C_Dates,3,FALSE), IF('Seeding Plan'!$C$8=\"East_Central\",VLOOKUP('Seeding Plan'!$B39,EC_Dates,3,FALSE), IF('Seeding Plan'!$C$8=\"Southwest\",VLOOKUP('Seeding Plan'!$B39,SW_Dates,3,FALSE), IF('Seeding Plan'!$C$8=\"South_Central\",VLOOKUP('Seeding Plan'!$B39,SC_Dates,3,FALSE),IF('Seeding Plan'!$C$8=\"Southeast\",VLOOKUP('Seeding Plan'!$B39,SE_Dates,3,FALSE)))))))))))","v":""},{"$f":"IF('Seeding Plan'!$B39=\"\",\"\",IF('Seeding Plan'!$C$8=\"Northwest\",VLOOKUP('Seeding Plan'!$B39,NW_Dates,4,FALSE),IF('Seeding Plan'!$C$8=\"North_Central\",VLOOKUP('Seeding Plan'!$B39,NC_Dates,4,FALSE),IF('Seeding Plan'!$C$8=\"Northeast\",VLOOKUP('Seeding Plan'!$B39,NE_Dates,4,FALSE),IF('Seeding Plan'!$C$8=\"West_Central\",VLOOKUP('Seeding Plan'!$B39,WC_Dates,4,FALSE),IF('Seeding Plan'!$C$8=\"Central\",VLOOKUP('Seeding Plan'!$B39,C_Dates,4,FALSE), IF('Seeding Plan'!$C$8=\"East_Central\",VLOOKUP('Seeding Plan'!$B39,EC_Dates,4,FALSE), IF('Seeding Plan'!$C$8=\"Southwest\",VLOOKUP('Seeding Plan'!$B39,SW_Dates,4,FALSE), IF('Seeding Plan'!$C$8=\"South_Central\",VLOOKUP('Seeding Plan'!$B39,SC_Dates,4,FALSE),IF('Seeding Plan'!$C$8=\"Southeast\",VLOOKUP('Seeding Plan'!$B39,SE_Dates,4,FALSE)))))))))))","v":""},{"$f":"IF('Seeding Plan'!$B39=\"\",\"\",IF('Seeding Plan'!$C$8=\"Northwest\",VLOOKUP('Seeding Plan'!$B39,NW_Dates,5,FALSE),IF('Seeding Plan'!$C$8=\"North_Central\",VLOOKUP('Seeding Plan'!$B39,NC_Dates,5,FALSE),IF('Seeding Plan'!$C$8=\"Northeast\",VLOOKUP('Seeding Plan'!$B39,NE_Dates,5,FALSE),IF('Seeding Plan'!$C$8=\"West_Central\",VLOOKUP('Seeding Plan'!$B39,WC_Dates,5,FALSE),IF('Seeding Plan'!$C$8=\"Central\",VLOOKUP('Seeding Plan'!$B39,C_Dates,5,FALSE), IF('Seeding Plan'!$C$8=\"East_Central\",VLOOKUP('Seeding Plan'!$B39,EC_Dates,5,FALSE), IF('Seeding Plan'!$C$8=\"Southwest\",VLOOKUP('Seeding Plan'!$B39,SW_Dates,5,FALSE), IF('Seeding Plan'!$C$8=\"South_Central\",VLOOKUP('Seeding Plan'!$B39,SC_Dates,5,FALSE),IF('Seeding Plan'!$C$8=\"Southeast\",VLOOKUP('Seeding Plan'!$B39,SE_Dates,5,FALSE)))))))))))","v":""},{"$f":"IF('Seeding Plan'!$B39=\"\",\"\",IF('Seeding Plan'!$C$8=\"Northwest\",VLOOKUP('Seeding Plan'!$B39,NW_Dates,6,FALSE),IF('Seeding Plan'!$C$8=\"North_Central\",VLOOKUP('Seeding Plan'!$B39,NC_Dates,6,FALSE),IF('Seeding Plan'!$C$8=\"Northeast\",VLOOKUP('Seeding Plan'!$B39,NE_Dates,6,FALSE),IF('Seeding Plan'!$C$8=\"West_Central\",VLOOKUP('Seeding Plan'!$B39,WC_Dates,6,FALSE),IF('Seeding Plan'!$C$8=\"Central\",VLOOKUP('Seeding Plan'!$B39,C_Dates,6,FALSE), IF('Seeding Plan'!$C$8=\"East_Central\",VLOOKUP('Seeding Plan'!$B39,EC_Dates,6,FALSE), IF('Seeding Plan'!$C$8=\"Southwest\",VLOOKUP('Seeding Plan'!$B39,SW_Dates,6,FALSE), IF('Seeding Plan'!$C$8=\"South_Central\",VLOOKUP('Seeding Plan'!$B39,SC_Dates,6,FALSE),IF('Seeding Plan'!$C$8=\"Southeast\",VLOOKUP('Seeding Plan'!$B39,SE_Dates,6,FALSE)))))))))))","v":""},{"$f":"IF('Seeding Plan'!$B39=\"\",\"\",IF('Seeding Plan'!$C$8=\"Northwest\",VLOOKUP('Seeding Plan'!$B39,NW_Dates,7,FALSE),IF('Seeding Plan'!$C$8=\"North_Central\",VLOOKUP('Seeding Plan'!$B39,NC_Dates,7,FALSE),IF('Seeding Plan'!$C$8=\"Northeast\",VLOOKUP('Seeding Plan'!$B39,NE_Dates,7,FALSE),IF('Seeding Plan'!$C$8=\"West_Central\",VLOOKUP('Seeding Plan'!$B39,WC_Dates,7,FALSE),IF('Seeding Plan'!$C$8=\"Central\",VLOOKUP('Seeding Plan'!$B39,C_Dates,7,FALSE), IF('Seeding Plan'!$C$8=\"East_Central\",VLOOKUP('Seeding Plan'!$B39,EC_Dates,7,FALSE), IF('Seeding Plan'!$C$8=\"Southwest\",VLOOKUP('Seeding Plan'!$B39,SW_Dates,7,FALSE), IF('Seeding Plan'!$C$8=\"South_Central\",VLOOKUP('Seeding Plan'!$B39,SC_Dates,7,FALSE),IF('Seeding Plan'!$C$8=\"Southeast\",VLOOKUP('Seeding Plan'!$B39,SE_Dates,7,FALSE)))))))))))","v":""},{"$f":"IF('Seeding Plan'!$B39=\"\",\"\",IF('Seeding Plan'!$C$8=\"Northwest\",VLOOKUP('Seeding Plan'!$B39,NW_Dates,8,FALSE),IF('Seeding Plan'!$C$8=\"North_Central\",VLOOKUP('Seeding Plan'!$B39,NC_Dates,8,FALSE),IF('Seeding Plan'!$C$8=\"Northeast\",VLOOKUP('Seeding Plan'!$B39,NE_Dates,8,FALSE),IF('Seeding Plan'!$C$8=\"West_Central\",VLOOKUP('Seeding Plan'!$B39,WC_Dates,8,FALSE),IF('Seeding Plan'!$C$8=\"Central\",VLOOKUP('Seeding Plan'!$B39,C_Dates,8,FALSE), IF('Seeding Plan'!$C$8=\"East_Central\",VLOOKUP('Seeding Plan'!$B39,EC_Dates,8,FALSE), IF('Seeding Plan'!$C$8=\"Southwest\",VLOOKUP('Seeding Plan'!$B39,SW_Dates,8,FALSE), IF('Seeding Plan'!$C$8=\"South_Central\",VLOOKUP('Seeding Plan'!$B39,SC_Dates,8,FALSE),IF('Seeding Plan'!$C$8=\"Southeast\",VLOOKUP('Seeding Plan'!$B39,SE_Dates,8,FALSE)))))))))))","v":""},{"$f":"IF('Seeding Plan'!$B39=\"\",\"\",IF('Seeding Plan'!$C$8=\"Northwest\",VLOOKUP('Seeding Plan'!$B39,NW_Dates,9,FALSE),IF('Seeding Plan'!$C$8=\"North_Central\",VLOOKUP('Seeding Plan'!$B39,NC_Dates,9,FALSE),IF('Seeding Plan'!$C$8=\"Northeast\",VLOOKUP('Seeding Plan'!$B39,NE_Dates,9,FALSE),IF('Seeding Plan'!$C$8=\"West_Central\",VLOOKUP('Seeding Plan'!$B39,WC_Dates,9,FALSE),IF('Seeding Plan'!$C$8=\"Central\",VLOOKUP('Seeding Plan'!$B39,C_Dates,9,FALSE), IF('Seeding Plan'!$C$8=\"East_Central\",VLOOKUP('Seeding Plan'!$B39,EC_Dates,9,FALSE), IF('Seeding Plan'!$C$8=\"Southwest\",VLOOKUP('Seeding Plan'!$B39,SW_Dates,9,FALSE), IF('Seeding Plan'!$C$8=\"South_Central\",VLOOKUP('Seeding Plan'!$B39,SC_Dates,9,FALSE),IF('Seeding Plan'!$C$8=\"Southeast\",VLOOKUP('Seeding Plan'!$B39,SE_Dates,9,FALSE)))))))))))","v":""}]
["Teff","-","2021-05-15","2021-08-07","2021-08-27","-","-","-","-",null,{"$f":"+'Seeding Plan'!B40","v":0},{"$f":"IF('Seeding Plan'!$B40=\"\",\"\",IF('Seeding Plan'!$C$8=\"Northwest\",VLOOKUP('Seeding Plan'!$B40,NW_Dates,2,FALSE),IF('Seeding Plan'!$C$8=\"North_Central\",VLOOKUP('Seeding Plan'!$B40,NC_Dates,2,FALSE),IF('Seeding Plan'!$C$8=\"Northeast\",VLOOKUP('Seeding Plan'!$B40,NE_Dates,2,FALSE),IF('Seeding Plan'!$C$8=\"West_Central\",VLOOKUP('Seeding Plan'!$B40,WC_Dates,2,FALSE),IF('Seeding Plan'!$C$8=\"Central\",VLOOKUP('Seeding Plan'!$B40,C_Dates,2,FALSE), IF('Seeding Plan'!$C$8=\"East_Central\",VLOOKUP('Seeding Plan'!$B40,EC_Dates,2,FALSE), IF('Seeding Plan'!$C$8=\"Southwest\",VLOOKUP('Seeding Plan'!$B40,SW_Dates,2,FALSE), IF('Seeding Plan'!$C$8=\"South_Central\",VLOOKUP('Seeding Plan'!$B40,SC_Dates,2,FALSE),IF('Seeding Plan'!$C$8=\"Southeast\",VLOOKUP('Seeding Plan'!$B40,SE_Dates,2,FALSE)))))))))))","v":""},{"$f":"IF('Seeding Plan'!B40=\"\",\"\",IF('Seeding Plan'!$C$8=\"Northwest\",VLOOKUP('Seeding Plan'!$B40,NW_Dates,3,FALSE),IF('Seeding Plan'!$C$8=\"North_Central\",VLOOKUP('Seeding Plan'!$B40,NC_Dates,3,FALSE),IF('Seeding Plan'!$C$8=\"Northeast\",VLOOKUP('Seeding Plan'!$B40,NE_Dates,3,FALSE),IF('Seeding Plan'!$C$8=\"West_Central\",VLOOKUP('Seeding Plan'!$B40,WC_Dates,3,FALSE),IF('Seeding Plan'!$C$8=\"Central\",VLOOKUP('Seeding Plan'!$B40,C_Dates,3,FALSE), IF('Seeding Plan'!$C$8=\"East_Central\",VLOOKUP('Seeding Plan'!$B40,EC_Dates,3,FALSE), IF('Seeding Plan'!$C$8=\"Southwest\",VLOOKUP('Seeding Plan'!$B40,SW_Dates,3,FALSE), IF('Seeding Plan'!$C$8=\"South_Central\",VLOOKUP('Seeding Plan'!$B40,SC_Dates,3,FALSE),IF('Seeding Plan'!$C$8=\"Southeast\",VLOOKUP('Seeding Plan'!$B40,SE_Dates,3,FALSE)))))))))))","v":""},{"$f":"IF('Seeding Plan'!$B40=\"\",\"\",IF('Seeding Plan'!$C$8=\"Northwest\",VLOOKUP('Seeding Plan'!$B40,NW_Dates,4,FALSE),IF('Seeding Plan'!$C$8=\"North_Central\",VLOOKUP('Seeding Plan'!$B40,NC_Dates,4,FALSE),IF('Seeding Plan'!$C$8=\"Northeast\",VLOOKUP('Seeding Plan'!$B40,NE_Dates,4,FALSE),IF('Seeding Plan'!$C$8=\"West_Central\",VLOOKUP('Seeding Plan'!$B40,WC_Dates,4,FALSE),IF('Seeding Plan'!$C$8=\"Central\",VLOOKUP('Seeding Plan'!$B40,C_Dates,4,FALSE), IF('Seeding Plan'!$C$8=\"East_Central\",VLOOKUP('Seeding Plan'!$B40,EC_Dates,4,FALSE), IF('Seeding Plan'!$C$8=\"Southwest\",VLOOKUP('Seeding Plan'!$B40,SW_Dates,4,FALSE), IF('Seeding Plan'!$C$8=\"South_Central\",VLOOKUP('Seeding Plan'!$B40,SC_Dates,4,FALSE),IF('Seeding Plan'!$C$8=\"Southeast\",VLOOKUP('Seeding Plan'!$B40,SE_Dates,4,FALSE)))))))))))","v":""},{"$f":"IF('Seeding Plan'!$B40=\"\",\"\",IF('Seeding Plan'!$C$8=\"Northwest\",VLOOKUP('Seeding Plan'!$B40,NW_Dates,5,FALSE),IF('Seeding Plan'!$C$8=\"North_Central\",VLOOKUP('Seeding Plan'!$B40,NC_Dates,5,FALSE),IF('Seeding Plan'!$C$8=\"Northeast\",VLOOKUP('Seeding Plan'!$B40,NE_Dates,5,FALSE),IF('Seeding Plan'!$C$8=\"West_Central\",VLOOKUP('Seeding Plan'!$B40,WC_Dates,5,FALSE),IF('Seeding Plan'!$C$8=\"Central\",VLOOKUP('Seeding Plan'!$B40,C_Dates,5,FALSE), IF('Seeding Plan'!$C$8=\"East_Central\",VLOOKUP('Seeding Plan'!$B40,EC_Dates,5,FALSE), IF('Seeding Plan'!$C$8=\"Southwest\",VLOOKUP('Seeding Plan'!$B40,SW_Dates,5,FALSE), IF('Seeding Plan'!$C$8=\"South_Central\",VLOOKUP('Seeding Plan'!$B40,SC_Dates,5,FALSE),IF('Seeding Plan'!$C$8=\"Southeast\",VLOOKUP('Seeding Plan'!$B40,SE_Dates,5,FALSE)))))))))))","v":""},{"$f":"IF('Seeding Plan'!$B40=\"\",\"\",IF('Seeding Plan'!$C$8=\"Northwest\",VLOOKUP('Seeding Plan'!$B40,NW_Dates,6,FALSE),IF('Seeding Plan'!$C$8=\"North_Central\",VLOOKUP('Seeding Plan'!$B40,NC_Dates,6,FALSE),IF('Seeding Plan'!$C$8=\"Northeast\",VLOOKUP('Seeding Plan'!$B40,NE_Dates,6,FALSE),IF('Seeding Plan'!$C$8=\"West_Central\",VLOOKUP('Seeding Plan'!$B40,WC_Dates,6,FALSE),IF('Seeding Plan'!$C$8=\"Central\",VLOOKUP('Seeding Plan'!$B40,C_Dates,6,FALSE), IF('Seeding Plan'!$C$8=\"East_Central\",VLOOKUP('Seeding Plan'!$B40,EC_Dates,6,FALSE), IF('Seeding Plan'!$C$8=\"Southwest\",VLOOKUP('Seeding Plan'!$B40,SW_Dates,6,FALSE), IF('Seeding Plan'!$C$8=\"South_Central\",VLOOKUP('Seeding Plan'!$B40,SC_Dates,6,FALSE),IF('Seeding Plan'!$C$8=\"Southeast\",VLOOKUP('Seeding Plan'!$B40,SE_Dates,6,FALSE)))))))))))","v":""},{"$f":"IF('Seeding Plan'!$B40=\"\",\"\",IF('Seeding Plan'!$C$8=\"Northwest\",VLOOKUP('Seeding Plan'!$B40,NW_Dates,7,FALSE),IF('Seeding Plan'!$C$8=\"North_Central\",VLOOKUP('Seeding Plan'!$B40,NC_Dates,7,FALSE),IF('Seeding Plan'!$C$8=\"Northeast\",VLOOKUP('Seeding Plan'!$B40,NE_Dates,7,FALSE),IF('Seeding Plan'!$C$8=\"West_Central\",VLOOKUP('Seeding Plan'!$B40,WC_Dates,7,FALSE),IF('Seeding Plan'!$C$8=\"Central\",VLOOKUP('Seeding Plan'!$B40,C_Dates,7,FALSE), IF('Seeding Plan'!$C$8=\"East_Central\",VLOOKUP('Seeding Plan'!$B40,EC_Dates,7,FALSE), IF('Seeding Plan'!$C$8=\"Southwest\",VLOOKUP('Seeding Plan'!$B40,SW_Dates,7,FALSE), IF('Seeding Plan'!$C$8=\"South_Central\",VLOOKUP('Seeding Plan'!$B40,SC_Dates,7,FALSE),IF('Seeding Plan'!$C$8=\"Southeast\",VLOOKUP('Seeding Plan'!$B40,SE_Dates,7,FALSE)))))))))))","v":""},{"$f":"IF('Seeding Plan'!$B40=\"\",\"\",IF('Seeding Plan'!$C$8=\"Northwest\",VLOOKUP('Seeding Plan'!$B40,NW_Dates,8,FALSE),IF('Seeding Plan'!$C$8=\"North_Central\",VLOOKUP('Seeding Plan'!$B40,NC_Dates,8,FALSE),IF('Seeding Plan'!$C$8=\"Northeast\",VLOOKUP('Seeding Plan'!$B40,NE_Dates,8,FALSE),IF('Seeding Plan'!$C$8=\"West_Central\",VLOOKUP('Seeding Plan'!$B40,WC_Dates,8,FALSE),IF('Seeding Plan'!$C$8=\"Central\",VLOOKUP('Seeding Plan'!$B40,C_Dates,8,FALSE), IF('Seeding Plan'!$C$8=\"East_Central\",VLOOKUP('Seeding Plan'!$B40,EC_Dates,8,FALSE), IF('Seeding Plan'!$C$8=\"Southwest\",VLOOKUP('Seeding Plan'!$B40,SW_Dates,8,FALSE), IF('Seeding Plan'!$C$8=\"South_Central\",VLOOKUP('Seeding Plan'!$B40,SC_Dates,8,FALSE),IF('Seeding Plan'!$C$8=\"Southeast\",VLOOKUP('Seeding Plan'!$B40,SE_Dates,8,FALSE)))))))))))","v":""},{"$f":"IF('Seeding Plan'!$B40=\"\",\"\",IF('Seeding Plan'!$C$8=\"Northwest\",VLOOKUP('Seeding Plan'!$B40,NW_Dates,9,FALSE),IF('Seeding Plan'!$C$8=\"North_Central\",VLOOKUP('Seeding Plan'!$B40,NC_Dates,9,FALSE),IF('Seeding Plan'!$C$8=\"Northeast\",VLOOKUP('Seeding Plan'!$B40,NE_Dates,9,FALSE),IF('Seeding Plan'!$C$8=\"West_Central\",VLOOKUP('Seeding Plan'!$B40,WC_Dates,9,FALSE),IF('Seeding Plan'!$C$8=\"Central\",VLOOKUP('Seeding Plan'!$B40,C_Dates,9,FALSE), IF('Seeding Plan'!$C$8=\"East_Central\",VLOOKUP('Seeding Plan'!$B40,EC_Dates,9,FALSE), IF('Seeding Plan'!$C$8=\"Southwest\",VLOOKUP('Seeding Plan'!$B40,SW_Dates,9,FALSE), IF('Seeding Plan'!$C$8=\"South_Central\",VLOOKUP('Seeding Plan'!$B40,SC_Dates,9,FALSE),IF('Seeding Plan'!$C$8=\"Southeast\",VLOOKUP('Seeding Plan'!$B40,SE_Dates,9,FALSE)))))))))))","v":""}]
["Triticale, Winter","-","-","-","-","2021-08-08","2021-08-21","2021-10-20","2021-11-01",null,{"$f":"+'Seeding Plan'!B41","v":0},{"$f":"IF('Seeding Plan'!$B41=\"\",\"\",IF('Seeding Plan'!$C$8=\"Northwest\",VLOOKUP('Seeding Plan'!$B41,NW_Dates,2,FALSE),IF('Seeding Plan'!$C$8=\"North_Central\",VLOOKUP('Seeding Plan'!$B41,NC_Dates,2,FALSE),IF('Seeding Plan'!$C$8=\"Northeast\",VLOOKUP('Seeding Plan'!$B41,NE_Dates,2,FALSE),IF('Seeding Plan'!$C$8=\"West_Central\",VLOOKUP('Seeding Plan'!$B41,WC_Dates,2,FALSE),IF('Seeding Plan'!$C$8=\"Central\",VLOOKUP('Seeding Plan'!$B41,C_Dates,2,FALSE), IF('Seeding Plan'!$C$8=\"East_Central\",VLOOKUP('Seeding Plan'!$B41,EC_Dates,2,FALSE), IF('Seeding Plan'!$C$8=\"Southwest\",VLOOKUP('Seeding Plan'!$B41,SW_Dates,2,FALSE), IF('Seeding Plan'!$C$8=\"South_Central\",VLOOKUP('Seeding Plan'!$B41,SC_Dates,2,FALSE),IF('Seeding Plan'!$C$8=\"Southeast\",VLOOKUP('Seeding Plan'!$B41,SE_Dates,2,FALSE)))))))))))","v":""},{"$f":"IF('Seeding Plan'!B41=\"\",\"\",IF('Seeding Plan'!$C$8=\"Northwest\",VLOOKUP('Seeding Plan'!$B41,NW_Dates,3,FALSE),IF('Seeding Plan'!$C$8=\"North_Central\",VLOOKUP('Seeding Plan'!$B41,NC_Dates,3,FALSE),IF('Seeding Plan'!$C$8=\"Northeast\",VLOOKUP('Seeding Plan'!$B41,NE_Dates,3,FALSE),IF('Seeding Plan'!$C$8=\"West_Central\",VLOOKUP('Seeding Plan'!$B41,WC_Dates,3,FALSE),IF('Seeding Plan'!$C$8=\"Central\",VLOOKUP('Seeding Plan'!$B41,C_Dates,3,FALSE), IF('Seeding Plan'!$C$8=\"East_Central\",VLOOKUP('Seeding Plan'!$B41,EC_Dates,3,FALSE), IF('Seeding Plan'!$C$8=\"Southwest\",VLOOKUP('Seeding Plan'!$B41,SW_Dates,3,FALSE), IF('Seeding Plan'!$C$8=\"South_Central\",VLOOKUP('Seeding Plan'!$B41,SC_Dates,3,FALSE),IF('Seeding Plan'!$C$8=\"Southeast\",VLOOKUP('Seeding Plan'!$B41,SE_Dates,3,FALSE)))))))))))","v":""},{"$f":"IF('Seeding Plan'!$B41=\"\",\"\",IF('Seeding Plan'!$C$8=\"Northwest\",VLOOKUP('Seeding Plan'!$B41,NW_Dates,4,FALSE),IF('Seeding Plan'!$C$8=\"North_Central\",VLOOKUP('Seeding Plan'!$B41,NC_Dates,4,FALSE),IF('Seeding Plan'!$C$8=\"Northeast\",VLOOKUP('Seeding Plan'!$B41,NE_Dates,4,FALSE),IF('Seeding Plan'!$C$8=\"West_Central\",VLOOKUP('Seeding Plan'!$B41,WC_Dates,4,FALSE),IF('Seeding Plan'!$C$8=\"Central\",VLOOKUP('Seeding Plan'!$B41,C_Dates,4,FALSE), IF('Seeding Plan'!$C$8=\"East_Central\",VLOOKUP('Seeding Plan'!$B41,EC_Dates,4,FALSE), IF('Seeding Plan'!$C$8=\"Southwest\",VLOOKUP('Seeding Plan'!$B41,SW_Dates,4,FALSE), IF('Seeding Plan'!$C$8=\"South_Central\",VLOOKUP('Seeding Plan'!$B41,SC_Dates,4,FALSE),IF('Seeding Plan'!$C$8=\"Southeast\",VLOOKUP('Seeding Plan'!$B41,SE_Dates,4,FALSE)))))))))))","v":""},{"$f":"IF('Seeding Plan'!$B41=\"\",\"\",IF('Seeding Plan'!$C$8=\"Northwest\",VLOOKUP('Seeding Plan'!$B41,NW_Dates,5,FALSE),IF('Seeding Plan'!$C$8=\"North_Central\",VLOOKUP('Seeding Plan'!$B41,NC_Dates,5,FALSE),IF('Seeding Plan'!$C$8=\"Northeast\",VLOOKUP('Seeding Plan'!$B41,NE_Dates,5,FALSE),IF('Seeding Plan'!$C$8=\"West_Central\",VLOOKUP('Seeding Plan'!$B41,WC_Dates,5,FALSE),IF('Seeding Plan'!$C$8=\"Central\",VLOOKUP('Seeding Plan'!$B41,C_Dates,5,FALSE), IF('Seeding Plan'!$C$8=\"East_Central\",VLOOKUP('Seeding Plan'!$B41,EC_Dates,5,FALSE), IF('Seeding Plan'!$C$8=\"Southwest\",VLOOKUP('Seeding Plan'!$B41,SW_Dates,5,FALSE), IF('Seeding Plan'!$C$8=\"South_Central\",VLOOKUP('Seeding Plan'!$B41,SC_Dates,5,FALSE),IF('Seeding Plan'!$C$8=\"Southeast\",VLOOKUP('Seeding Plan'!$B41,SE_Dates,5,FALSE)))))))))))","v":""},{"$f":"IF('Seeding Plan'!$B41=\"\",\"\",IF('Seeding Plan'!$C$8=\"Northwest\",VLOOKUP('Seeding Plan'!$B41,NW_Dates,6,FALSE),IF('Seeding Plan'!$C$8=\"North_Central\",VLOOKUP('Seeding Plan'!$B41,NC_Dates,6,FALSE),IF('Seeding Plan'!$C$8=\"Northeast\",VLOOKUP('Seeding Plan'!$B41,NE_Dates,6,FALSE),IF('Seeding Plan'!$C$8=\"West_Central\",VLOOKUP('Seeding Plan'!$B41,WC_Dates,6,FALSE),IF('Seeding Plan'!$C$8=\"Central\",VLOOKUP('Seeding Plan'!$B41,C_Dates,6,FALSE), IF('Seeding Plan'!$C$8=\"East_Central\",VLOOKUP('Seeding Plan'!$B41,EC_Dates,6,FALSE), IF('Seeding Plan'!$C$8=\"Southwest\",VLOOKUP('Seeding Plan'!$B41,SW_Dates,6,FALSE), IF('Seeding Plan'!$C$8=\"South_Central\",VLOOKUP('Seeding Plan'!$B41,SC_Dates,6,FALSE),IF('Seeding Plan'!$C$8=\"Southeast\",VLOOKUP('Seeding Plan'!$B41,SE_Dates,6,FALSE)))))))))))","v":""},{"$f":"IF('Seeding Plan'!$B41=\"\",\"\",IF('Seeding Plan'!$C$8=\"Northwest\",VLOOKUP('Seeding Plan'!$B41,NW_Dates,7,FALSE),IF('Seeding Plan'!$C$8=\"North_Central\",VLOOKUP('Seeding Plan'!$B41,NC_Dates,7,FALSE),IF('Seeding Plan'!$C$8=\"Northeast\",VLOOKUP('Seeding Plan'!$B41,NE_Dates,7,FALSE),IF('Seeding Plan'!$C$8=\"West_Central\",VLOOKUP('Seeding Plan'!$B41,WC_Dates,7,FALSE),IF('Seeding Plan'!$C$8=\"Central\",VLOOKUP('Seeding Plan'!$B41,C_Dates,7,FALSE), IF('Seeding Plan'!$C$8=\"East_Central\",VLOOKUP('Seeding Plan'!$B41,EC_Dates,7,FALSE), IF('Seeding Plan'!$C$8=\"Southwest\",VLOOKUP('Seeding Plan'!$B41,SW_Dates,7,FALSE), IF('Seeding Plan'!$C$8=\"South_Central\",VLOOKUP('Seeding Plan'!$B41,SC_Dates,7,FALSE),IF('Seeding Plan'!$C$8=\"Southeast\",VLOOKUP('Seeding Plan'!$B41,SE_Dates,7,FALSE)))))))))))","v":""},{"$f":"IF('Seeding Plan'!$B41=\"\",\"\",IF('Seeding Plan'!$C$8=\"Northwest\",VLOOKUP('Seeding Plan'!$B41,NW_Dates,8,FALSE),IF('Seeding Plan'!$C$8=\"North_Central\",VLOOKUP('Seeding Plan'!$B41,NC_Dates,8,FALSE),IF('Seeding Plan'!$C$8=\"Northeast\",VLOOKUP('Seeding Plan'!$B41,NE_Dates,8,FALSE),IF('Seeding Plan'!$C$8=\"West_Central\",VLOOKUP('Seeding Plan'!$B41,WC_Dates,8,FALSE),IF('Seeding Plan'!$C$8=\"Central\",VLOOKUP('Seeding Plan'!$B41,C_Dates,8,FALSE), IF('Seeding Plan'!$C$8=\"East_Central\",VLOOKUP('Seeding Plan'!$B41,EC_Dates,8,FALSE), IF('Seeding Plan'!$C$8=\"Southwest\",VLOOKUP('Seeding Plan'!$B41,SW_Dates,8,FALSE), IF('Seeding Plan'!$C$8=\"South_Central\",VLOOKUP('Seeding Plan'!$B41,SC_Dates,8,FALSE),IF('Seeding Plan'!$C$8=\"Southeast\",VLOOKUP('Seeding Plan'!$B41,SE_Dates,8,FALSE)))))))))))","v":""},{"$f":"IF('Seeding Plan'!$B41=\"\",\"\",IF('Seeding Plan'!$C$8=\"Northwest\",VLOOKUP('Seeding Plan'!$B41,NW_Dates,9,FALSE),IF('Seeding Plan'!$C$8=\"North_Central\",VLOOKUP('Seeding Plan'!$B41,NC_Dates,9,FALSE),IF('Seeding Plan'!$C$8=\"Northeast\",VLOOKUP('Seeding Plan'!$B41,NE_Dates,9,FALSE),IF('Seeding Plan'!$C$8=\"West_Central\",VLOOKUP('Seeding Plan'!$B41,WC_Dates,9,FALSE),IF('Seeding Plan'!$C$8=\"Central\",VLOOKUP('Seeding Plan'!$B41,C_Dates,9,FALSE), IF('Seeding Plan'!$C$8=\"East_Central\",VLOOKUP('Seeding Plan'!$B41,EC_Dates,9,FALSE), IF('Seeding Plan'!$C$8=\"Southwest\",VLOOKUP('Seeding Plan'!$B41,SW_Dates,9,FALSE), IF('Seeding Plan'!$C$8=\"South_Central\",VLOOKUP('Seeding Plan'!$B41,SC_Dates,9,FALSE),IF('Seeding Plan'!$C$8=\"Southeast\",VLOOKUP('Seeding Plan'!$B41,SE_Dates,9,FALSE)))))))))))","v":""}]
["Turnip","2021-04-03","--","--",{"$f":"I113","v":"2021-09-23"},{"$f":"B113","v":"2021-04-03"},"2021-08-08","2021-09-09","2021-09-23",null,{"$f":"+'Seeding Plan'!B42","v":0},{"$f":"IF('Seeding Plan'!$B42=\"\",\"\",IF('Seeding Plan'!$C$8=\"Northwest\",VLOOKUP('Seeding Plan'!$B42,NW_Dates,2,FALSE),IF('Seeding Plan'!$C$8=\"North_Central\",VLOOKUP('Seeding Plan'!$B42,NC_Dates,2,FALSE),IF('Seeding Plan'!$C$8=\"Northeast\",VLOOKUP('Seeding Plan'!$B42,NE_Dates,2,FALSE),IF('Seeding Plan'!$C$8=\"West_Central\",VLOOKUP('Seeding Plan'!$B42,WC_Dates,2,FALSE),IF('Seeding Plan'!$C$8=\"Central\",VLOOKUP('Seeding Plan'!$B42,C_Dates,2,FALSE), IF('Seeding Plan'!$C$8=\"East_Central\",VLOOKUP('Seeding Plan'!$B42,EC_Dates,2,FALSE), IF('Seeding Plan'!$C$8=\"Southwest\",VLOOKUP('Seeding Plan'!$B42,SW_Dates,2,FALSE), IF('Seeding Plan'!$C$8=\"South_Central\",VLOOKUP('Seeding Plan'!$B42,SC_Dates,2,FALSE),IF('Seeding Plan'!$C$8=\"Southeast\",VLOOKUP('Seeding Plan'!$B42,SE_Dates,2,FALSE)))))))))))","v":""},{"$f":"IF('Seeding Plan'!B42=\"\",\"\",IF('Seeding Plan'!$C$8=\"Northwest\",VLOOKUP('Seeding Plan'!$B42,NW_Dates,3,FALSE),IF('Seeding Plan'!$C$8=\"North_Central\",VLOOKUP('Seeding Plan'!$B42,NC_Dates,3,FALSE),IF('Seeding Plan'!$C$8=\"Northeast\",VLOOKUP('Seeding Plan'!$B42,NE_Dates,3,FALSE),IF('Seeding Plan'!$C$8=\"West_Central\",VLOOKUP('Seeding Plan'!$B42,WC_Dates,3,FALSE),IF('Seeding Plan'!$C$8=\"Central\",VLOOKUP('Seeding Plan'!$B42,C_Dates,3,FALSE), IF('Seeding Plan'!$C$8=\"East_Central\",VLOOKUP('Seeding Plan'!$B42,EC_Dates,3,FALSE), IF('Seeding Plan'!$C$8=\"Southwest\",VLOOKUP('Seeding Plan'!$B42,SW_Dates,3,FALSE), IF('Seeding Plan'!$C$8=\"South_Central\",VLOOKUP('Seeding Plan'!$B42,SC_Dates,3,FALSE),IF('Seeding Plan'!$C$8=\"Southeast\",VLOOKUP('Seeding Plan'!$B42,SE_Dates,3,FALSE)))))))))))","v":""},{"$f":"IF('Seeding Plan'!$B42=\"\",\"\",IF('Seeding Plan'!$C$8=\"Northwest\",VLOOKUP('Seeding Plan'!$B42,NW_Dates,4,FALSE),IF('Seeding Plan'!$C$8=\"North_Central\",VLOOKUP('Seeding Plan'!$B42,NC_Dates,4,FALSE),IF('Seeding Plan'!$C$8=\"Northeast\",VLOOKUP('Seeding Plan'!$B42,NE_Dates,4,FALSE),IF('Seeding Plan'!$C$8=\"West_Central\",VLOOKUP('Seeding Plan'!$B42,WC_Dates,4,FALSE),IF('Seeding Plan'!$C$8=\"Central\",VLOOKUP('Seeding Plan'!$B42,C_Dates,4,FALSE), IF('Seeding Plan'!$C$8=\"East_Central\",VLOOKUP('Seeding Plan'!$B42,EC_Dates,4,FALSE), IF('Seeding Plan'!$C$8=\"Southwest\",VLOOKUP('Seeding Plan'!$B42,SW_Dates,4,FALSE), IF('Seeding Plan'!$C$8=\"South_Central\",VLOOKUP('Seeding Plan'!$B42,SC_Dates,4,FALSE),IF('Seeding Plan'!$C$8=\"Southeast\",VLOOKUP('Seeding Plan'!$B42,SE_Dates,4,FALSE)))))))))))","v":""},{"$f":"IF('Seeding Plan'!$B42=\"\",\"\",IF('Seeding Plan'!$C$8=\"Northwest\",VLOOKUP('Seeding Plan'!$B42,NW_Dates,5,FALSE),IF('Seeding Plan'!$C$8=\"North_Central\",VLOOKUP('Seeding Plan'!$B42,NC_Dates,5,FALSE),IF('Seeding Plan'!$C$8=\"Northeast\",VLOOKUP('Seeding Plan'!$B42,NE_Dates,5,FALSE),IF('Seeding Plan'!$C$8=\"West_Central\",VLOOKUP('Seeding Plan'!$B42,WC_Dates,5,FALSE),IF('Seeding Plan'!$C$8=\"Central\",VLOOKUP('Seeding Plan'!$B42,C_Dates,5,FALSE), IF('Seeding Plan'!$C$8=\"East_Central\",VLOOKUP('Seeding Plan'!$B42,EC_Dates,5,FALSE), IF('Seeding Plan'!$C$8=\"Southwest\",VLOOKUP('Seeding Plan'!$B42,SW_Dates,5,FALSE), IF('Seeding Plan'!$C$8=\"South_Central\",VLOOKUP('Seeding Plan'!$B42,SC_Dates,5,FALSE),IF('Seeding Plan'!$C$8=\"Southeast\",VLOOKUP('Seeding Plan'!$B42,SE_Dates,5,FALSE)))))))))))","v":""},{"$f":"IF('Seeding Plan'!$B42=\"\",\"\",IF('Seeding Plan'!$C$8=\"Northwest\",VLOOKUP('Seeding Plan'!$B42,NW_Dates,6,FALSE),IF('Seeding Plan'!$C$8=\"North_Central\",VLOOKUP('Seeding Plan'!$B42,NC_Dates,6,FALSE),IF('Seeding Plan'!$C$8=\"Northeast\",VLOOKUP('Seeding Plan'!$B42,NE_Dates,6,FALSE),IF('Seeding Plan'!$C$8=\"West_Central\",VLOOKUP('Seeding Plan'!$B42,WC_Dates,6,FALSE),IF('Seeding Plan'!$C$8=\"Central\",VLOOKUP('Seeding Plan'!$B42,C_Dates,6,FALSE), IF('Seeding Plan'!$C$8=\"East_Central\",VLOOKUP('Seeding Plan'!$B42,EC_Dates,6,FALSE), IF('Seeding Plan'!$C$8=\"Southwest\",VLOOKUP('Seeding Plan'!$B42,SW_Dates,6,FALSE), IF('Seeding Plan'!$C$8=\"South_Central\",VLOOKUP('Seeding Plan'!$B42,SC_Dates,6,FALSE),IF('Seeding Plan'!$C$8=\"Southeast\",VLOOKUP('Seeding Plan'!$B42,SE_Dates,6,FALSE)))))))))))","v":""},{"$f":"IF('Seeding Plan'!$B42=\"\",\"\",IF('Seeding Plan'!$C$8=\"Northwest\",VLOOKUP('Seeding Plan'!$B42,NW_Dates,7,FALSE),IF('Seeding Plan'!$C$8=\"North_Central\",VLOOKUP('Seeding Plan'!$B42,NC_Dates,7,FALSE),IF('Seeding Plan'!$C$8=\"Northeast\",VLOOKUP('Seeding Plan'!$B42,NE_Dates,7,FALSE),IF('Seeding Plan'!$C$8=\"West_Central\",VLOOKUP('Seeding Plan'!$B42,WC_Dates,7,FALSE),IF('Seeding Plan'!$C$8=\"Central\",VLOOKUP('Seeding Plan'!$B42,C_Dates,7,FALSE), IF('Seeding Plan'!$C$8=\"East_Central\",VLOOKUP('Seeding Plan'!$B42,EC_Dates,7,FALSE), IF('Seeding Plan'!$C$8=\"Southwest\",VLOOKUP('Seeding Plan'!$B42,SW_Dates,7,FALSE), IF('Seeding Plan'!$C$8=\"South_Central\",VLOOKUP('Seeding Plan'!$B42,SC_Dates,7,FALSE),IF('Seeding Plan'!$C$8=\"Southeast\",VLOOKUP('Seeding Plan'!$B42,SE_Dates,7,FALSE)))))))))))","v":""},{"$f":"IF('Seeding Plan'!$B42=\"\",\"\",IF('Seeding Plan'!$C$8=\"Northwest\",VLOOKUP('Seeding Plan'!$B42,NW_Dates,8,FALSE),IF('Seeding Plan'!$C$8=\"North_Central\",VLOOKUP('Seeding Plan'!$B42,NC_Dates,8,FALSE),IF('Seeding Plan'!$C$8=\"Northeast\",VLOOKUP('Seeding Plan'!$B42,NE_Dates,8,FALSE),IF('Seeding Plan'!$C$8=\"West_Central\",VLOOKUP('Seeding Plan'!$B42,WC_Dates,8,FALSE),IF('Seeding Plan'!$C$8=\"Central\",VLOOKUP('Seeding Plan'!$B42,C_Dates,8,FALSE), IF('Seeding Plan'!$C$8=\"East_Central\",VLOOKUP('Seeding Plan'!$B42,EC_Dates,8,FALSE), IF('Seeding Plan'!$C$8=\"Southwest\",VLOOKUP('Seeding Plan'!$B42,SW_Dates,8,FALSE), IF('Seeding Plan'!$C$8=\"South_Central\",VLOOKUP('Seeding Plan'!$B42,SC_Dates,8,FALSE),IF('Seeding Plan'!$C$8=\"Southeast\",VLOOKUP('Seeding Plan'!$B42,SE_Dates,8,FALSE)))))))))))","v":""},{"$f":"IF('Seeding Plan'!$B42=\"\",\"\",IF('Seeding Plan'!$C$8=\"Northwest\",VLOOKUP('Seeding Plan'!$B42,NW_Dates,9,FALSE),IF('Seeding Plan'!$C$8=\"North_Central\",VLOOKUP('Seeding Plan'!$B42,NC_Dates,9,FALSE),IF('Seeding Plan'!$C$8=\"Northeast\",VLOOKUP('Seeding Plan'!$B42,NE_Dates,9,FALSE),IF('Seeding Plan'!$C$8=\"West_Central\",VLOOKUP('Seeding Plan'!$B42,WC_Dates,9,FALSE),IF('Seeding Plan'!$C$8=\"Central\",VLOOKUP('Seeding Plan'!$B42,C_Dates,9,FALSE), IF('Seeding Plan'!$C$8=\"East_Central\",VLOOKUP('Seeding Plan'!$B42,EC_Dates,9,FALSE), IF('Seeding Plan'!$C$8=\"Southwest\",VLOOKUP('Seeding Plan'!$B42,SW_Dates,9,FALSE), IF('Seeding Plan'!$C$8=\"South_Central\",VLOOKUP('Seeding Plan'!$B42,SC_Dates,9,FALSE),IF('Seeding Plan'!$C$8=\"Southeast\",VLOOKUP('Seeding Plan'!$B42,SE_Dates,9,FALSE)))))))))))","v":""}]
["Vetch, Common","-","2021-04-03","2021-05-22","-","-","2021-07-26","2021-08-27","2021-09-09",null,{"$f":"+'Seeding Plan'!B43","v":0},{"$f":"IF('Seeding Plan'!$B43=\"\",\"\",IF('Seeding Plan'!$C$8=\"Northwest\",VLOOKUP('Seeding Plan'!$B43,NW_Dates,2,FALSE),IF('Seeding Plan'!$C$8=\"North_Central\",VLOOKUP('Seeding Plan'!$B43,NC_Dates,2,FALSE),IF('Seeding Plan'!$C$8=\"Northeast\",VLOOKUP('Seeding Plan'!$B43,NE_Dates,2,FALSE),IF('Seeding Plan'!$C$8=\"West_Central\",VLOOKUP('Seeding Plan'!$B43,WC_Dates,2,FALSE),IF('Seeding Plan'!$C$8=\"Central\",VLOOKUP('Seeding Plan'!$B43,C_Dates,2,FALSE), IF('Seeding Plan'!$C$8=\"East_Central\",VLOOKUP('Seeding Plan'!$B43,EC_Dates,2,FALSE), IF('Seeding Plan'!$C$8=\"Southwest\",VLOOKUP('Seeding Plan'!$B43,SW_Dates,2,FALSE), IF('Seeding Plan'!$C$8=\"South_Central\",VLOOKUP('Seeding Plan'!$B43,SC_Dates,2,FALSE),IF('Seeding Plan'!$C$8=\"Southeast\",VLOOKUP('Seeding Plan'!$B43,SE_Dates,2,FALSE)))))))))))","v":""},{"$f":"IF('Seeding Plan'!B43=\"\",\"\",IF('Seeding Plan'!$C$8=\"Northwest\",VLOOKUP('Seeding Plan'!$B43,NW_Dates,3,FALSE),IF('Seeding Plan'!$C$8=\"North_Central\",VLOOKUP('Seeding Plan'!$B43,NC_Dates,3,FALSE),IF('Seeding Plan'!$C$8=\"Northeast\",VLOOKUP('Seeding Plan'!$B43,NE_Dates,3,FALSE),IF('Seeding Plan'!$C$8=\"West_Central\",VLOOKUP('Seeding Plan'!$B43,WC_Dates,3,FALSE),IF('Seeding Plan'!$C$8=\"Central\",VLOOKUP('Seeding Plan'!$B43,C_Dates,3,FALSE), IF('Seeding Plan'!$C$8=\"East_Central\",VLOOKUP('Seeding Plan'!$B43,EC_Dates,3,FALSE), IF('Seeding Plan'!$C$8=\"Southwest\",VLOOKUP('Seeding Plan'!$B43,SW_Dates,3,FALSE), IF('Seeding Plan'!$C$8=\"South_Central\",VLOOKUP('Seeding Plan'!$B43,SC_Dates,3,FALSE),IF('Seeding Plan'!$C$8=\"Southeast\",VLOOKUP('Seeding Plan'!$B43,SE_Dates,3,FALSE)))))))))))","v":""},{"$f":"IF('Seeding Plan'!$B43=\"\",\"\",IF('Seeding Plan'!$C$8=\"Northwest\",VLOOKUP('Seeding Plan'!$B43,NW_Dates,4,FALSE),IF('Seeding Plan'!$C$8=\"North_Central\",VLOOKUP('Seeding Plan'!$B43,NC_Dates,4,FALSE),IF('Seeding Plan'!$C$8=\"Northeast\",VLOOKUP('Seeding Plan'!$B43,NE_Dates,4,FALSE),IF('Seeding Plan'!$C$8=\"West_Central\",VLOOKUP('Seeding Plan'!$B43,WC_Dates,4,FALSE),IF('Seeding Plan'!$C$8=\"Central\",VLOOKUP('Seeding Plan'!$B43,C_Dates,4,FALSE), IF('Seeding Plan'!$C$8=\"East_Central\",VLOOKUP('Seeding Plan'!$B43,EC_Dates,4,FALSE), IF('Seeding Plan'!$C$8=\"Southwest\",VLOOKUP('Seeding Plan'!$B43,SW_Dates,4,FALSE), IF('Seeding Plan'!$C$8=\"South_Central\",VLOOKUP('Seeding Plan'!$B43,SC_Dates,4,FALSE),IF('Seeding Plan'!$C$8=\"Southeast\",VLOOKUP('Seeding Plan'!$B43,SE_Dates,4,FALSE)))))))))))","v":""},{"$f":"IF('Seeding Plan'!$B43=\"\",\"\",IF('Seeding Plan'!$C$8=\"Northwest\",VLOOKUP('Seeding Plan'!$B43,NW_Dates,5,FALSE),IF('Seeding Plan'!$C$8=\"North_Central\",VLOOKUP('Seeding Plan'!$B43,NC_Dates,5,FALSE),IF('Seeding Plan'!$C$8=\"Northeast\",VLOOKUP('Seeding Plan'!$B43,NE_Dates,5,FALSE),IF('Seeding Plan'!$C$8=\"West_Central\",VLOOKUP('Seeding Plan'!$B43,WC_Dates,5,FALSE),IF('Seeding Plan'!$C$8=\"Central\",VLOOKUP('Seeding Plan'!$B43,C_Dates,5,FALSE), IF('Seeding Plan'!$C$8=\"East_Central\",VLOOKUP('Seeding Plan'!$B43,EC_Dates,5,FALSE), IF('Seeding Plan'!$C$8=\"Southwest\",VLOOKUP('Seeding Plan'!$B43,SW_Dates,5,FALSE), IF('Seeding Plan'!$C$8=\"South_Central\",VLOOKUP('Seeding Plan'!$B43,SC_Dates,5,FALSE),IF('Seeding Plan'!$C$8=\"Southeast\",VLOOKUP('Seeding Plan'!$B43,SE_Dates,5,FALSE)))))))))))","v":""},{"$f":"IF('Seeding Plan'!$B43=\"\",\"\",IF('Seeding Plan'!$C$8=\"Northwest\",VLOOKUP('Seeding Plan'!$B43,NW_Dates,6,FALSE),IF('Seeding Plan'!$C$8=\"North_Central\",VLOOKUP('Seeding Plan'!$B43,NC_Dates,6,FALSE),IF('Seeding Plan'!$C$8=\"Northeast\",VLOOKUP('Seeding Plan'!$B43,NE_Dates,6,FALSE),IF('Seeding Plan'!$C$8=\"West_Central\",VLOOKUP('Seeding Plan'!$B43,WC_Dates,6,FALSE),IF('Seeding Plan'!$C$8=\"Central\",VLOOKUP('Seeding Plan'!$B43,C_Dates,6,FALSE), IF('Seeding Plan'!$C$8=\"East_Central\",VLOOKUP('Seeding Plan'!$B43,EC_Dates,6,FALSE), IF('Seeding Plan'!$C$8=\"Southwest\",VLOOKUP('Seeding Plan'!$B43,SW_Dates,6,FALSE), IF('Seeding Plan'!$C$8=\"South_Central\",VLOOKUP('Seeding Plan'!$B43,SC_Dates,6,FALSE),IF('Seeding Plan'!$C$8=\"Southeast\",VLOOKUP('Seeding Plan'!$B43,SE_Dates,6,FALSE)))))))))))","v":""},{"$f":"IF('Seeding Plan'!$B43=\"\",\"\",IF('Seeding Plan'!$C$8=\"Northwest\",VLOOKUP('Seeding Plan'!$B43,NW_Dates,7,FALSE),IF('Seeding Plan'!$C$8=\"North_Central\",VLOOKUP('Seeding Plan'!$B43,NC_Dates,7,FALSE),IF('Seeding Plan'!$C$8=\"Northeast\",VLOOKUP('Seeding Plan'!$B43,NE_Dates,7,FALSE),IF('Seeding Plan'!$C$8=\"West_Central\",VLOOKUP('Seeding Plan'!$B43,WC_Dates,7,FALSE),IF('Seeding Plan'!$C$8=\"Central\",VLOOKUP('Seeding Plan'!$B43,C_Dates,7,FALSE), IF('Seeding Plan'!$C$8=\"East_Central\",VLOOKUP('Seeding Plan'!$B43,EC_Dates,7,FALSE), IF('Seeding Plan'!$C$8=\"Southwest\",VLOOKUP('Seeding Plan'!$B43,SW_Dates,7,FALSE), IF('Seeding Plan'!$C$8=\"South_Central\",VLOOKUP('Seeding Plan'!$B43,SC_Dates,7,FALSE),IF('Seeding Plan'!$C$8=\"Southeast\",VLOOKUP('Seeding Plan'!$B43,SE_Dates,7,FALSE)))))))))))","v":""},{"$f":"IF('Seeding Plan'!$B43=\"\",\"\",IF('Seeding Plan'!$C$8=\"Northwest\",VLOOKUP('Seeding Plan'!$B43,NW_Dates,8,FALSE),IF('Seeding Plan'!$C$8=\"North_Central\",VLOOKUP('Seeding Plan'!$B43,NC_Dates,8,FALSE),IF('Seeding Plan'!$C$8=\"Northeast\",VLOOKUP('Seeding Plan'!$B43,NE_Dates,8,FALSE),IF('Seeding Plan'!$C$8=\"West_Central\",VLOOKUP('Seeding Plan'!$B43,WC_Dates,8,FALSE),IF('Seeding Plan'!$C$8=\"Central\",VLOOKUP('Seeding Plan'!$B43,C_Dates,8,FALSE), IF('Seeding Plan'!$C$8=\"East_Central\",VLOOKUP('Seeding Plan'!$B43,EC_Dates,8,FALSE), IF('Seeding Plan'!$C$8=\"Southwest\",VLOOKUP('Seeding Plan'!$B43,SW_Dates,8,FALSE), IF('Seeding Plan'!$C$8=\"South_Central\",VLOOKUP('Seeding Plan'!$B43,SC_Dates,8,FALSE),IF('Seeding Plan'!$C$8=\"Southeast\",VLOOKUP('Seeding Plan'!$B43,SE_Dates,8,FALSE)))))))))))","v":""},{"$f":"IF('Seeding Plan'!$B43=\"\",\"\",IF('Seeding Plan'!$C$8=\"Northwest\",VLOOKUP('Seeding Plan'!$B43,NW_Dates,9,FALSE),IF('Seeding Plan'!$C$8=\"North_Central\",VLOOKUP('Seeding Plan'!$B43,NC_Dates,9,FALSE),IF('Seeding Plan'!$C$8=\"Northeast\",VLOOKUP('Seeding Plan'!$B43,NE_Dates,9,FALSE),IF('Seeding Plan'!$C$8=\"West_Central\",VLOOKUP('Seeding Plan'!$B43,WC_Dates,9,FALSE),IF('Seeding Plan'!$C$8=\"Central\",VLOOKUP('Seeding Plan'!$B43,C_Dates,9,FALSE), IF('Seeding Plan'!$C$8=\"East_Central\",VLOOKUP('Seeding Plan'!$B43,EC_Dates,9,FALSE), IF('Seeding Plan'!$C$8=\"Southwest\",VLOOKUP('Seeding Plan'!$B43,SW_Dates,9,FALSE), IF('Seeding Plan'!$C$8=\"South_Central\",VLOOKUP('Seeding Plan'!$B43,SC_Dates,9,FALSE),IF('Seeding Plan'!$C$8=\"Southeast\",VLOOKUP('Seeding Plan'!$B43,SE_Dates,9,FALSE)))))))))))","v":""}]
["Vetch, Hairy","-","2021-04-03","2021-06-04","-","-","2021-08-08","2021-09-09","2021-09-16",null,{"$f":"+'Seeding Plan'!B44","v":0},{"$f":"IF('Seeding Plan'!$B44=\"\",\"\",IF('Seeding Plan'!$C$8=\"Northwest\",VLOOKUP('Seeding Plan'!$B44,NW_Dates,2,FALSE),IF('Seeding Plan'!$C$8=\"North_Central\",VLOOKUP('Seeding Plan'!$B44,NC_Dates,2,FALSE),IF('Seeding Plan'!$C$8=\"Northeast\",VLOOKUP('Seeding Plan'!$B44,NE_Dates,2,FALSE),IF('Seeding Plan'!$C$8=\"West_Central\",VLOOKUP('Seeding Plan'!$B44,WC_Dates,2,FALSE),IF('Seeding Plan'!$C$8=\"Central\",VLOOKUP('Seeding Plan'!$B44,C_Dates,2,FALSE), IF('Seeding Plan'!$C$8=\"East_Central\",VLOOKUP('Seeding Plan'!$B44,EC_Dates,2,FALSE), IF('Seeding Plan'!$C$8=\"Southwest\",VLOOKUP('Seeding Plan'!$B44,SW_Dates,2,FALSE), IF('Seeding Plan'!$C$8=\"South_Central\",VLOOKUP('Seeding Plan'!$B44,SC_Dates,2,FALSE),IF('Seeding Plan'!$C$8=\"Southeast\",VLOOKUP('Seeding Plan'!$B44,SE_Dates,2,FALSE)))))))))))","v":""},{"$f":"IF('Seeding Plan'!B44=\"\",\"\",IF('Seeding Plan'!$C$8=\"Northwest\",VLOOKUP('Seeding Plan'!$B44,NW_Dates,3,FALSE),IF('Seeding Plan'!$C$8=\"North_Central\",VLOOKUP('Seeding Plan'!$B44,NC_Dates,3,FALSE),IF('Seeding Plan'!$C$8=\"Northeast\",VLOOKUP('Seeding Plan'!$B44,NE_Dates,3,FALSE),IF('Seeding Plan'!$C$8=\"West_Central\",VLOOKUP('Seeding Plan'!$B44,WC_Dates,3,FALSE),IF('Seeding Plan'!$C$8=\"Central\",VLOOKUP('Seeding Plan'!$B44,C_Dates,3,FALSE), IF('Seeding Plan'!$C$8=\"East_Central\",VLOOKUP('Seeding Plan'!$B44,EC_Dates,3,FALSE), IF('Seeding Plan'!$C$8=\"Southwest\",VLOOKUP('Seeding Plan'!$B44,SW_Dates,3,FALSE), IF('Seeding Plan'!$C$8=\"South_Central\",VLOOKUP('Seeding Plan'!$B44,SC_Dates,3,FALSE),IF('Seeding Plan'!$C$8=\"Southeast\",VLOOKUP('Seeding Plan'!$B44,SE_Dates,3,FALSE)))))))))))","v":""},{"$f":"IF('Seeding Plan'!$B44=\"\",\"\",IF('Seeding Plan'!$C$8=\"Northwest\",VLOOKUP('Seeding Plan'!$B44,NW_Dates,4,FALSE),IF('Seeding Plan'!$C$8=\"North_Central\",VLOOKUP('Seeding Plan'!$B44,NC_Dates,4,FALSE),IF('Seeding Plan'!$C$8=\"Northeast\",VLOOKUP('Seeding Plan'!$B44,NE_Dates,4,FALSE),IF('Seeding Plan'!$C$8=\"West_Central\",VLOOKUP('Seeding Plan'!$B44,WC_Dates,4,FALSE),IF('Seeding Plan'!$C$8=\"Central\",VLOOKUP('Seeding Plan'!$B44,C_Dates,4,FALSE), IF('Seeding Plan'!$C$8=\"East_Central\",VLOOKUP('Seeding Plan'!$B44,EC_Dates,4,FALSE), IF('Seeding Plan'!$C$8=\"Southwest\",VLOOKUP('Seeding Plan'!$B44,SW_Dates,4,FALSE), IF('Seeding Plan'!$C$8=\"South_Central\",VLOOKUP('Seeding Plan'!$B44,SC_Dates,4,FALSE),IF('Seeding Plan'!$C$8=\"Southeast\",VLOOKUP('Seeding Plan'!$B44,SE_Dates,4,FALSE)))))))))))","v":""},{"$f":"IF('Seeding Plan'!$B44=\"\",\"\",IF('Seeding Plan'!$C$8=\"Northwest\",VLOOKUP('Seeding Plan'!$B44,NW_Dates,5,FALSE),IF('Seeding Plan'!$C$8=\"North_Central\",VLOOKUP('Seeding Plan'!$B44,NC_Dates,5,FALSE),IF('Seeding Plan'!$C$8=\"Northeast\",VLOOKUP('Seeding Plan'!$B44,NE_Dates,5,FALSE),IF('Seeding Plan'!$C$8=\"West_Central\",VLOOKUP('Seeding Plan'!$B44,WC_Dates,5,FALSE),IF('Seeding Plan'!$C$8=\"Central\",VLOOKUP('Seeding Plan'!$B44,C_Dates,5,FALSE), IF('Seeding Plan'!$C$8=\"East_Central\",VLOOKUP('Seeding Plan'!$B44,EC_Dates,5,FALSE), IF('Seeding Plan'!$C$8=\"Southwest\",VLOOKUP('Seeding Plan'!$B44,SW_Dates,5,FALSE), IF('Seeding Plan'!$C$8=\"South_Central\",VLOOKUP('Seeding Plan'!$B44,SC_Dates,5,FALSE),IF('Seeding Plan'!$C$8=\"Southeast\",VLOOKUP('Seeding Plan'!$B44,SE_Dates,5,FALSE)))))))))))","v":""},{"$f":"IF('Seeding Plan'!$B44=\"\",\"\",IF('Seeding Plan'!$C$8=\"Northwest\",VLOOKUP('Seeding Plan'!$B44,NW_Dates,6,FALSE),IF('Seeding Plan'!$C$8=\"North_Central\",VLOOKUP('Seeding Plan'!$B44,NC_Dates,6,FALSE),IF('Seeding Plan'!$C$8=\"Northeast\",VLOOKUP('Seeding Plan'!$B44,NE_Dates,6,FALSE),IF('Seeding Plan'!$C$8=\"West_Central\",VLOOKUP('Seeding Plan'!$B44,WC_Dates,6,FALSE),IF('Seeding Plan'!$C$8=\"Central\",VLOOKUP('Seeding Plan'!$B44,C_Dates,6,FALSE), IF('Seeding Plan'!$C$8=\"East_Central\",VLOOKUP('Seeding Plan'!$B44,EC_Dates,6,FALSE), IF('Seeding Plan'!$C$8=\"Southwest\",VLOOKUP('Seeding Plan'!$B44,SW_Dates,6,FALSE), IF('Seeding Plan'!$C$8=\"South_Central\",VLOOKUP('Seeding Plan'!$B44,SC_Dates,6,FALSE),IF('Seeding Plan'!$C$8=\"Southeast\",VLOOKUP('Seeding Plan'!$B44,SE_Dates,6,FALSE)))))))))))","v":""},{"$f":"IF('Seeding Plan'!$B44=\"\",\"\",IF('Seeding Plan'!$C$8=\"Northwest\",VLOOKUP('Seeding Plan'!$B44,NW_Dates,7,FALSE),IF('Seeding Plan'!$C$8=\"North_Central\",VLOOKUP('Seeding Plan'!$B44,NC_Dates,7,FALSE),IF('Seeding Plan'!$C$8=\"Northeast\",VLOOKUP('Seeding Plan'!$B44,NE_Dates,7,FALSE),IF('Seeding Plan'!$C$8=\"West_Central\",VLOOKUP('Seeding Plan'!$B44,WC_Dates,7,FALSE),IF('Seeding Plan'!$C$8=\"Central\",VLOOKUP('Seeding Plan'!$B44,C_Dates,7,FALSE), IF('Seeding Plan'!$C$8=\"East_Central\",VLOOKUP('Seeding Plan'!$B44,EC_Dates,7,FALSE), IF('Seeding Plan'!$C$8=\"Southwest\",VLOOKUP('Seeding Plan'!$B44,SW_Dates,7,FALSE), IF('Seeding Plan'!$C$8=\"South_Central\",VLOOKUP('Seeding Plan'!$B44,SC_Dates,7,FALSE),IF('Seeding Plan'!$C$8=\"Southeast\",VLOOKUP('Seeding Plan'!$B44,SE_Dates,7,FALSE)))))))))))","v":""},{"$f":"IF('Seeding Plan'!$B44=\"\",\"\",IF('Seeding Plan'!$C$8=\"Northwest\",VLOOKUP('Seeding Plan'!$B44,NW_Dates,8,FALSE),IF('Seeding Plan'!$C$8=\"North_Central\",VLOOKUP('Seeding Plan'!$B44,NC_Dates,8,FALSE),IF('Seeding Plan'!$C$8=\"Northeast\",VLOOKUP('Seeding Plan'!$B44,NE_Dates,8,FALSE),IF('Seeding Plan'!$C$8=\"West_Central\",VLOOKUP('Seeding Plan'!$B44,WC_Dates,8,FALSE),IF('Seeding Plan'!$C$8=\"Central\",VLOOKUP('Seeding Plan'!$B44,C_Dates,8,FALSE), IF('Seeding Plan'!$C$8=\"East_Central\",VLOOKUP('Seeding Plan'!$B44,EC_Dates,8,FALSE), IF('Seeding Plan'!$C$8=\"Southwest\",VLOOKUP('Seeding Plan'!$B44,SW_Dates,8,FALSE), IF('Seeding Plan'!$C$8=\"South_Central\",VLOOKUP('Seeding Plan'!$B44,SC_Dates,8,FALSE),IF('Seeding Plan'!$C$8=\"Southeast\",VLOOKUP('Seeding Plan'!$B44,SE_Dates,8,FALSE)))))))))))","v":""},{"$f":"IF('Seeding Plan'!$B44=\"\",\"\",IF('Seeding Plan'!$C$8=\"Northwest\",VLOOKUP('Seeding Plan'!$B44,NW_Dates,9,FALSE),IF('Seeding Plan'!$C$8=\"North_Central\",VLOOKUP('Seeding Plan'!$B44,NC_Dates,9,FALSE),IF('Seeding Plan'!$C$8=\"Northeast\",VLOOKUP('Seeding Plan'!$B44,NE_Dates,9,FALSE),IF('Seeding Plan'!$C$8=\"West_Central\",VLOOKUP('Seeding Plan'!$B44,WC_Dates,9,FALSE),IF('Seeding Plan'!$C$8=\"Central\",VLOOKUP('Seeding Plan'!$B44,C_Dates,9,FALSE), IF('Seeding Plan'!$C$8=\"East_Central\",VLOOKUP('Seeding Plan'!$B44,EC_Dates,9,FALSE), IF('Seeding Plan'!$C$8=\"Southwest\",VLOOKUP('Seeding Plan'!$B44,SW_Dates,9,FALSE), IF('Seeding Plan'!$C$8=\"South_Central\",VLOOKUP('Seeding Plan'!$B44,SC_Dates,9,FALSE),IF('Seeding Plan'!$C$8=\"Southeast\",VLOOKUP('Seeding Plan'!$B44,SE_Dates,9,FALSE)))))))))))","v":""}]
["Wheat, Spring","2021-03-19","2021-04-03","2021-05-02","2021-05-29","2021-08-08","2021-08-21","2021-09-09","2021-09-23",null,{"$f":"+'Seeding Plan'!B45","v":0},{"$f":"IF('Seeding Plan'!$B45=\"\",\"\",IF('Seeding Plan'!$C$8=\"Northwest\",VLOOKUP('Seeding Plan'!$B45,NW_Dates,2,FALSE),IF('Seeding Plan'!$C$8=\"North_Central\",VLOOKUP('Seeding Plan'!$B45,NC_Dates,2,FALSE),IF('Seeding Plan'!$C$8=\"Northeast\",VLOOKUP('Seeding Plan'!$B45,NE_Dates,2,FALSE),IF('Seeding Plan'!$C$8=\"West_Central\",VLOOKUP('Seeding Plan'!$B45,WC_Dates,2,FALSE),IF('Seeding Plan'!$C$8=\"Central\",VLOOKUP('Seeding Plan'!$B45,C_Dates,2,FALSE), IF('Seeding Plan'!$C$8=\"East_Central\",VLOOKUP('Seeding Plan'!$B45,EC_Dates,2,FALSE), IF('Seeding Plan'!$C$8=\"Southwest\",VLOOKUP('Seeding Plan'!$B45,SW_Dates,2,FALSE), IF('Seeding Plan'!$C$8=\"South_Central\",VLOOKUP('Seeding Plan'!$B45,SC_Dates,2,FALSE),IF('Seeding Plan'!$C$8=\"Southeast\",VLOOKUP('Seeding Plan'!$B45,SE_Dates,2,FALSE)))))))))))","v":""},{"$f":"IF('Seeding Plan'!B45=\"\",\"\",IF('Seeding Plan'!$C$8=\"Northwest\",VLOOKUP('Seeding Plan'!$B45,NW_Dates,3,FALSE),IF('Seeding Plan'!$C$8=\"North_Central\",VLOOKUP('Seeding Plan'!$B45,NC_Dates,3,FALSE),IF('Seeding Plan'!$C$8=\"Northeast\",VLOOKUP('Seeding Plan'!$B45,NE_Dates,3,FALSE),IF('Seeding Plan'!$C$8=\"West_Central\",VLOOKUP('Seeding Plan'!$B45,WC_Dates,3,FALSE),IF('Seeding Plan'!$C$8=\"Central\",VLOOKUP('Seeding Plan'!$B45,C_Dates,3,FALSE), IF('Seeding Plan'!$C$8=\"East_Central\",VLOOKUP('Seeding Plan'!$B45,EC_Dates,3,FALSE), IF('Seeding Plan'!$C$8=\"Southwest\",VLOOKUP('Seeding Plan'!$B45,SW_Dates,3,FALSE), IF('Seeding Plan'!$C$8=\"South_Central\",VLOOKUP('Seeding Plan'!$B45,SC_Dates,3,FALSE),IF('Seeding Plan'!$C$8=\"Southeast\",VLOOKUP('Seeding Plan'!$B45,SE_Dates,3,FALSE)))))))))))","v":""},{"$f":"IF('Seeding Plan'!$B45=\"\",\"\",IF('Seeding Plan'!$C$8=\"Northwest\",VLOOKUP('Seeding Plan'!$B45,NW_Dates,4,FALSE),IF('Seeding Plan'!$C$8=\"North_Central\",VLOOKUP('Seeding Plan'!$B45,NC_Dates,4,FALSE),IF('Seeding Plan'!$C$8=\"Northeast\",VLOOKUP('Seeding Plan'!$B45,NE_Dates,4,FALSE),IF('Seeding Plan'!$C$8=\"West_Central\",VLOOKUP('Seeding Plan'!$B45,WC_Dates,4,FALSE),IF('Seeding Plan'!$C$8=\"Central\",VLOOKUP('Seeding Plan'!$B45,C_Dates,4,FALSE), IF('Seeding Plan'!$C$8=\"East_Central\",VLOOKUP('Seeding Plan'!$B45,EC_Dates,4,FALSE), IF('Seeding Plan'!$C$8=\"Southwest\",VLOOKUP('Seeding Plan'!$B45,SW_Dates,4,FALSE), IF('Seeding Plan'!$C$8=\"South_Central\",VLOOKUP('Seeding Plan'!$B45,SC_Dates,4,FALSE),IF('Seeding Plan'!$C$8=\"Southeast\",VLOOKUP('Seeding Plan'!$B45,SE_Dates,4,FALSE)))))))))))","v":""},{"$f":"IF('Seeding Plan'!$B45=\"\",\"\",IF('Seeding Plan'!$C$8=\"Northwest\",VLOOKUP('Seeding Plan'!$B45,NW_Dates,5,FALSE),IF('Seeding Plan'!$C$8=\"North_Central\",VLOOKUP('Seeding Plan'!$B45,NC_Dates,5,FALSE),IF('Seeding Plan'!$C$8=\"Northeast\",VLOOKUP('Seeding Plan'!$B45,NE_Dates,5,FALSE),IF('Seeding Plan'!$C$8=\"West_Central\",VLOOKUP('Seeding Plan'!$B45,WC_Dates,5,FALSE),IF('Seeding Plan'!$C$8=\"Central\",VLOOKUP('Seeding Plan'!$B45,C_Dates,5,FALSE), IF('Seeding Plan'!$C$8=\"East_Central\",VLOOKUP('Seeding Plan'!$B45,EC_Dates,5,FALSE), IF('Seeding Plan'!$C$8=\"Southwest\",VLOOKUP('Seeding Plan'!$B45,SW_Dates,5,FALSE), IF('Seeding Plan'!$C$8=\"South_Central\",VLOOKUP('Seeding Plan'!$B45,SC_Dates,5,FALSE),IF('Seeding Plan'!$C$8=\"Southeast\",VLOOKUP('Seeding Plan'!$B45,SE_Dates,5,FALSE)))))))))))","v":""},{"$f":"IF('Seeding Plan'!$B45=\"\",\"\",IF('Seeding Plan'!$C$8=\"Northwest\",VLOOKUP('Seeding Plan'!$B45,NW_Dates,6,FALSE),IF('Seeding Plan'!$C$8=\"North_Central\",VLOOKUP('Seeding Plan'!$B45,NC_Dates,6,FALSE),IF('Seeding Plan'!$C$8=\"Northeast\",VLOOKUP('Seeding Plan'!$B45,NE_Dates,6,FALSE),IF('Seeding Plan'!$C$8=\"West_Central\",VLOOKUP('Seeding Plan'!$B45,WC_Dates,6,FALSE),IF('Seeding Plan'!$C$8=\"Central\",VLOOKUP('Seeding Plan'!$B45,C_Dates,6,FALSE), IF('Seeding Plan'!$C$8=\"East_Central\",VLOOKUP('Seeding Plan'!$B45,EC_Dates,6,FALSE), IF('Seeding Plan'!$C$8=\"Southwest\",VLOOKUP('Seeding Plan'!$B45,SW_Dates,6,FALSE), IF('Seeding Plan'!$C$8=\"South_Central\",VLOOKUP('Seeding Plan'!$B45,SC_Dates,6,FALSE),IF('Seeding Plan'!$C$8=\"Southeast\",VLOOKUP('Seeding Plan'!$B45,SE_Dates,6,FALSE)))))))))))","v":""},{"$f":"IF('Seeding Plan'!$B45=\"\",\"\",IF('Seeding Plan'!$C$8=\"Northwest\",VLOOKUP('Seeding Plan'!$B45,NW_Dates,7,FALSE),IF('Seeding Plan'!$C$8=\"North_Central\",VLOOKUP('Seeding Plan'!$B45,NC_Dates,7,FALSE),IF('Seeding Plan'!$C$8=\"Northeast\",VLOOKUP('Seeding Plan'!$B45,NE_Dates,7,FALSE),IF('Seeding Plan'!$C$8=\"West_Central\",VLOOKUP('Seeding Plan'!$B45,WC_Dates,7,FALSE),IF('Seeding Plan'!$C$8=\"Central\",VLOOKUP('Seeding Plan'!$B45,C_Dates,7,FALSE), IF('Seeding Plan'!$C$8=\"East_Central\",VLOOKUP('Seeding Plan'!$B45,EC_Dates,7,FALSE), IF('Seeding Plan'!$C$8=\"Southwest\",VLOOKUP('Seeding Plan'!$B45,SW_Dates,7,FALSE), IF('Seeding Plan'!$C$8=\"South_Central\",VLOOKUP('Seeding Plan'!$B45,SC_Dates,7,FALSE),IF('Seeding Plan'!$C$8=\"Southeast\",VLOOKUP('Seeding Plan'!$B45,SE_Dates,7,FALSE)))))))))))","v":""},{"$f":"IF('Seeding Plan'!$B45=\"\",\"\",IF('Seeding Plan'!$C$8=\"Northwest\",VLOOKUP('Seeding Plan'!$B45,NW_Dates,8,FALSE),IF('Seeding Plan'!$C$8=\"North_Central\",VLOOKUP('Seeding Plan'!$B45,NC_Dates,8,FALSE),IF('Seeding Plan'!$C$8=\"Northeast\",VLOOKUP('Seeding Plan'!$B45,NE_Dates,8,FALSE),IF('Seeding Plan'!$C$8=\"West_Central\",VLOOKUP('Seeding Plan'!$B45,WC_Dates,8,FALSE),IF('Seeding Plan'!$C$8=\"Central\",VLOOKUP('Seeding Plan'!$B45,C_Dates,8,FALSE), IF('Seeding Plan'!$C$8=\"East_Central\",VLOOKUP('Seeding Plan'!$B45,EC_Dates,8,FALSE), IF('Seeding Plan'!$C$8=\"Southwest\",VLOOKUP('Seeding Plan'!$B45,SW_Dates,8,FALSE), IF('Seeding Plan'!$C$8=\"South_Central\",VLOOKUP('Seeding Plan'!$B45,SC_Dates,8,FALSE),IF('Seeding Plan'!$C$8=\"Southeast\",VLOOKUP('Seeding Plan'!$B45,SE_Dates,8,FALSE)))))))))))","v":""},{"$f":"IF('Seeding Plan'!$B45=\"\",\"\",IF('Seeding Plan'!$C$8=\"Northwest\",VLOOKUP('Seeding Plan'!$B45,NW_Dates,9,FALSE),IF('Seeding Plan'!$C$8=\"North_Central\",VLOOKUP('Seeding Plan'!$B45,NC_Dates,9,FALSE),IF('Seeding Plan'!$C$8=\"Northeast\",VLOOKUP('Seeding Plan'!$B45,NE_Dates,9,FALSE),IF('Seeding Plan'!$C$8=\"West_Central\",VLOOKUP('Seeding Plan'!$B45,WC_Dates,9,FALSE),IF('Seeding Plan'!$C$8=\"Central\",VLOOKUP('Seeding Plan'!$B45,C_Dates,9,FALSE), IF('Seeding Plan'!$C$8=\"East_Central\",VLOOKUP('Seeding Plan'!$B45,EC_Dates,9,FALSE), IF('Seeding Plan'!$C$8=\"Southwest\",VLOOKUP('Seeding Plan'!$B45,SW_Dates,9,FALSE), IF('Seeding Plan'!$C$8=\"South_Central\",VLOOKUP('Seeding Plan'!$B45,SC_Dates,9,FALSE),IF('Seeding Plan'!$C$8=\"Southeast\",VLOOKUP('Seeding Plan'!$B45,SE_Dates,9,FALSE)))))))))))","v":""}]
["Wheat, Winter","-","-","-","-","2021-08-08","2021-08-21","2021-10-07","2021-10-19",null,{"$f":"+'Seeding Plan'!B46","v":0},{"$f":"IF('Seeding Plan'!$B46=\"\",\"\",IF('Seeding Plan'!$C$8=\"Northwest\",VLOOKUP('Seeding Plan'!$B46,NW_Dates,2,FALSE),IF('Seeding Plan'!$C$8=\"North_Central\",VLOOKUP('Seeding Plan'!$B46,NC_Dates,2,FALSE),IF('Seeding Plan'!$C$8=\"Northeast\",VLOOKUP('Seeding Plan'!$B46,NE_Dates,2,FALSE),IF('Seeding Plan'!$C$8=\"West_Central\",VLOOKUP('Seeding Plan'!$B46,WC_Dates,2,FALSE),IF('Seeding Plan'!$C$8=\"Central\",VLOOKUP('Seeding Plan'!$B46,C_Dates,2,FALSE), IF('Seeding Plan'!$C$8=\"East_Central\",VLOOKUP('Seeding Plan'!$B46,EC_Dates,2,FALSE), IF('Seeding Plan'!$C$8=\"Southwest\",VLOOKUP('Seeding Plan'!$B46,SW_Dates,2,FALSE), IF('Seeding Plan'!$C$8=\"South_Central\",VLOOKUP('Seeding Plan'!$B46,SC_Dates,2,FALSE),IF('Seeding Plan'!$C$8=\"Southeast\",VLOOKUP('Seeding Plan'!$B46,SE_Dates,2,FALSE)))))))))))","v":""},{"$f":"IF('Seeding Plan'!B46=\"\",\"\",IF('Seeding Plan'!$C$8=\"Northwest\",VLOOKUP('Seeding Plan'!$B46,NW_Dates,3,FALSE),IF('Seeding Plan'!$C$8=\"North_Central\",VLOOKUP('Seeding Plan'!$B46,NC_Dates,3,FALSE),IF('Seeding Plan'!$C$8=\"Northeast\",VLOOKUP('Seeding Plan'!$B46,NE_Dates,3,FALSE),IF('Seeding Plan'!$C$8=\"West_Central\",VLOOKUP('Seeding Plan'!$B46,WC_Dates,3,FALSE),IF('Seeding Plan'!$C$8=\"Central\",VLOOKUP('Seeding Plan'!$B46,C_Dates,3,FALSE), IF('Seeding Plan'!$C$8=\"East_Central\",VLOOKUP('Seeding Plan'!$B46,EC_Dates,3,FALSE), IF('Seeding Plan'!$C$8=\"Southwest\",VLOOKUP('Seeding Plan'!$B46,SW_Dates,3,FALSE), IF('Seeding Plan'!$C$8=\"South_Central\",VLOOKUP('Seeding Plan'!$B46,SC_Dates,3,FALSE),IF('Seeding Plan'!$C$8=\"Southeast\",VLOOKUP('Seeding Plan'!$B46,SE_Dates,3,FALSE)))))))))))","v":""},{"$f":"IF('Seeding Plan'!$B46=\"\",\"\",IF('Seeding Plan'!$C$8=\"Northwest\",VLOOKUP('Seeding Plan'!$B46,NW_Dates,4,FALSE),IF('Seeding Plan'!$C$8=\"North_Central\",VLOOKUP('Seeding Plan'!$B46,NC_Dates,4,FALSE),IF('Seeding Plan'!$C$8=\"Northeast\",VLOOKUP('Seeding Plan'!$B46,NE_Dates,4,FALSE),IF('Seeding Plan'!$C$8=\"West_Central\",VLOOKUP('Seeding Plan'!$B46,WC_Dates,4,FALSE),IF('Seeding Plan'!$C$8=\"Central\",VLOOKUP('Seeding Plan'!$B46,C_Dates,4,FALSE), IF('Seeding Plan'!$C$8=\"East_Central\",VLOOKUP('Seeding Plan'!$B46,EC_Dates,4,FALSE), IF('Seeding Plan'!$C$8=\"Southwest\",VLOOKUP('Seeding Plan'!$B46,SW_Dates,4,FALSE), IF('Seeding Plan'!$C$8=\"South_Central\",VLOOKUP('Seeding Plan'!$B46,SC_Dates,4,FALSE),IF('Seeding Plan'!$C$8=\"Southeast\",VLOOKUP('Seeding Plan'!$B46,SE_Dates,4,FALSE)))))))))))","v":""},{"$f":"IF('Seeding Plan'!$B46=\"\",\"\",IF('Seeding Plan'!$C$8=\"Northwest\",VLOOKUP('Seeding Plan'!$B46,NW_Dates,5,FALSE),IF('Seeding Plan'!$C$8=\"North_Central\",VLOOKUP('Seeding Plan'!$B46,NC_Dates,5,FALSE),IF('Seeding Plan'!$C$8=\"Northeast\",VLOOKUP('Seeding Plan'!$B46,NE_Dates,5,FALSE),IF('Seeding Plan'!$C$8=\"West_Central\",VLOOKUP('Seeding Plan'!$B46,WC_Dates,5,FALSE),IF('Seeding Plan'!$C$8=\"Central\",VLOOKUP('Seeding Plan'!$B46,C_Dates,5,FALSE), IF('Seeding Plan'!$C$8=\"East_Central\",VLOOKUP('Seeding Plan'!$B46,EC_Dates,5,FALSE), IF('Seeding Plan'!$C$8=\"Southwest\",VLOOKUP('Seeding Plan'!$B46,SW_Dates,5,FALSE), IF('Seeding Plan'!$C$8=\"South_Central\",VLOOKUP('Seeding Plan'!$B46,SC_Dates,5,FALSE),IF('Seeding Plan'!$C$8=\"Southeast\",VLOOKUP('Seeding Plan'!$B46,SE_Dates,5,FALSE)))))))))))","v":""},{"$f":"IF('Seeding Plan'!$B46=\"\",\"\",IF('Seeding Plan'!$C$8=\"Northwest\",VLOOKUP('Seeding Plan'!$B46,NW_Dates,6,FALSE),IF('Seeding Plan'!$C$8=\"North_Central\",VLOOKUP('Seeding Plan'!$B46,NC_Dates,6,FALSE),IF('Seeding Plan'!$C$8=\"Northeast\",VLOOKUP('Seeding Plan'!$B46,NE_Dates,6,FALSE),IF('Seeding Plan'!$C$8=\"West_Central\",VLOOKUP('Seeding Plan'!$B46,WC_Dates,6,FALSE),IF('Seeding Plan'!$C$8=\"Central\",VLOOKUP('Seeding Plan'!$B46,C_Dates,6,FALSE), IF('Seeding Plan'!$C$8=\"East_Central\",VLOOKUP('Seeding Plan'!$B46,EC_Dates,6,FALSE), IF('Seeding Plan'!$C$8=\"Southwest\",VLOOKUP('Seeding Plan'!$B46,SW_Dates,6,FALSE), IF('Seeding Plan'!$C$8=\"South_Central\",VLOOKUP('Seeding Plan'!$B46,SC_Dates,6,FALSE),IF('Seeding Plan'!$C$8=\"Southeast\",VLOOKUP('Seeding Plan'!$B46,SE_Dates,6,FALSE)))))))))))","v":""},{"$f":"IF('Seeding Plan'!$B46=\"\",\"\",IF('Seeding Plan'!$C$8=\"Northwest\",VLOOKUP('Seeding Plan'!$B46,NW_Dates,7,FALSE),IF('Seeding Plan'!$C$8=\"North_Central\",VLOOKUP('Seeding Plan'!$B46,NC_Dates,7,FALSE),IF('Seeding Plan'!$C$8=\"Northeast\",VLOOKUP('Seeding Plan'!$B46,NE_Dates,7,FALSE),IF('Seeding Plan'!$C$8=\"West_Central\",VLOOKUP('Seeding Plan'!$B46,WC_Dates,7,FALSE),IF('Seeding Plan'!$C$8=\"Central\",VLOOKUP('Seeding Plan'!$B46,C_Dates,7,FALSE), IF('Seeding Plan'!$C$8=\"East_Central\",VLOOKUP('Seeding Plan'!$B46,EC_Dates,7,FALSE), IF('Seeding Plan'!$C$8=\"Southwest\",VLOOKUP('Seeding Plan'!$B46,SW_Dates,7,FALSE), IF('Seeding Plan'!$C$8=\"South_Central\",VLOOKUP('Seeding Plan'!$B46,SC_Dates,7,FALSE),IF('Seeding Plan'!$C$8=\"Southeast\",VLOOKUP('Seeding Plan'!$B46,SE_Dates,7,FALSE)))))))))))","v":""},{"$f":"IF('Seeding Plan'!$B46=\"\",\"\",IF('Seeding Plan'!$C$8=\"Northwest\",VLOOKUP('Seeding Plan'!$B46,NW_Dates,8,FALSE),IF('Seeding Plan'!$C$8=\"North_Central\",VLOOKUP('Seeding Plan'!$B46,NC_Dates,8,FALSE),IF('Seeding Plan'!$C$8=\"Northeast\",VLOOKUP('Seeding Plan'!$B46,NE_Dates,8,FALSE),IF('Seeding Plan'!$C$8=\"West_Central\",VLOOKUP('Seeding Plan'!$B46,WC_Dates,8,FALSE),IF('Seeding Plan'!$C$8=\"Central\",VLOOKUP('Seeding Plan'!$B46,C_Dates,8,FALSE), IF('Seeding Plan'!$C$8=\"East_Central\",VLOOKUP('Seeding Plan'!$B46,EC_Dates,8,FALSE), IF('Seeding Plan'!$C$8=\"Southwest\",VLOOKUP('Seeding Plan'!$B46,SW_Dates,8,FALSE), IF('Seeding Plan'!$C$8=\"South_Central\",VLOOKUP('Seeding Plan'!$B46,SC_Dates,8,FALSE),IF('Seeding Plan'!$C$8=\"Southeast\",VLOOKUP('Seeding Plan'!$B46,SE_Dates,8,FALSE)))))))))))","v":""},{"$f":"IF('Seeding Plan'!$B46=\"\",\"\",IF('Seeding Plan'!$C$8=\"Northwest\",VLOOKUP('Seeding Plan'!$B46,NW_Dates,9,FALSE),IF('Seeding Plan'!$C$8=\"North_Central\",VLOOKUP('Seeding Plan'!$B46,NC_Dates,9,FALSE),IF('Seeding Plan'!$C$8=\"Northeast\",VLOOKUP('Seeding Plan'!$B46,NE_Dates,9,FALSE),IF('Seeding Plan'!$C$8=\"West_Central\",VLOOKUP('Seeding Plan'!$B46,WC_Dates,9,FALSE),IF('Seeding Plan'!$C$8=\"Central\",VLOOKUP('Seeding Plan'!$B46,C_Dates,9,FALSE), IF('Seeding Plan'!$C$8=\"East_Central\",VLOOKUP('Seeding Plan'!$B46,EC_Dates,9,FALSE), IF('Seeding Plan'!$C$8=\"Southwest\",VLOOKUP('Seeding Plan'!$B46,SW_Dates,9,FALSE), IF('Seeding Plan'!$C$8=\"South_Central\",VLOOKUP('Seeding Plan'!$B46,SC_Dates,9,FALSE),IF('Seeding Plan'!$C$8=\"Southeast\",VLOOKUP('Seeding Plan'!$B46,SE_Dates,9,FALSE)))))))))))","v":""}]
[null,null,null,null,null,null,null,null,null,null,{"$f":"+'Seeding Plan'!B47","v":0},{"$f":"IF('Seeding Plan'!$B47=\"\",\"\",IF('Seeding Plan'!$C$8=\"Northwest\",VLOOKUP('Seeding Plan'!$B47,NW_Dates,2,FALSE),IF('Seeding Plan'!$C$8=\"North_Central\",VLOOKUP('Seeding Plan'!$B47,NC_Dates,2,FALSE),IF('Seeding Plan'!$C$8=\"Northeast\",VLOOKUP('Seeding Plan'!$B47,NE_Dates,2,FALSE),IF('Seeding Plan'!$C$8=\"West_Central\",VLOOKUP('Seeding Plan'!$B47,WC_Dates,2,FALSE),IF('Seeding Plan'!$C$8=\"Central\",VLOOKUP('Seeding Plan'!$B47,C_Dates,2,FALSE), IF('Seeding Plan'!$C$8=\"East_Central\",VLOOKUP('Seeding Plan'!$B47,EC_Dates,2,FALSE), IF('Seeding Plan'!$C$8=\"Southwest\",VLOOKUP('Seeding Plan'!$B47,SW_Dates,2,FALSE), IF('Seeding Plan'!$C$8=\"South_Central\",VLOOKUP('Seeding Plan'!$B47,SC_Dates,2,FALSE),IF('Seeding Plan'!$C$8=\"Southeast\",VLOOKUP('Seeding Plan'!$B47,SE_Dates,2,FALSE)))))))))))","v":""},{"$f":"IF('Seeding Plan'!B47=\"\",\"\",IF('Seeding Plan'!$C$8=\"Northwest\",VLOOKUP('Seeding Plan'!$B47,NW_Dates,3,FALSE),IF('Seeding Plan'!$C$8=\"North_Central\",VLOOKUP('Seeding Plan'!$B47,NC_Dates,3,FALSE),IF('Seeding Plan'!$C$8=\"Northeast\",VLOOKUP('Seeding Plan'!$B47,NE_Dates,3,FALSE),IF('Seeding Plan'!$C$8=\"West_Central\",VLOOKUP('Seeding Plan'!$B47,WC_Dates,3,FALSE),IF('Seeding Plan'!$C$8=\"Central\",VLOOKUP('Seeding Plan'!$B47,C_Dates,3,FALSE), IF('Seeding Plan'!$C$8=\"East_Central\",VLOOKUP('Seeding Plan'!$B47,EC_Dates,3,FALSE), IF('Seeding Plan'!$C$8=\"Southwest\",VLOOKUP('Seeding Plan'!$B47,SW_Dates,3,FALSE), IF('Seeding Plan'!$C$8=\"South_Central\",VLOOKUP('Seeding Plan'!$B47,SC_Dates,3,FALSE),IF('Seeding Plan'!$C$8=\"Southeast\",VLOOKUP('Seeding Plan'!$B47,SE_Dates,3,FALSE)))))))))))","v":""},{"$f":"IF('Seeding Plan'!$B47=\"\",\"\",IF('Seeding Plan'!$C$8=\"Northwest\",VLOOKUP('Seeding Plan'!$B47,NW_Dates,4,FALSE),IF('Seeding Plan'!$C$8=\"North_Central\",VLOOKUP('Seeding Plan'!$B47,NC_Dates,4,FALSE),IF('Seeding Plan'!$C$8=\"Northeast\",VLOOKUP('Seeding Plan'!$B47,NE_Dates,4,FALSE),IF('Seeding Plan'!$C$8=\"West_Central\",VLOOKUP('Seeding Plan'!$B47,WC_Dates,4,FALSE),IF('Seeding Plan'!$C$8=\"Central\",VLOOKUP('Seeding Plan'!$B47,C_Dates,4,FALSE), IF('Seeding Plan'!$C$8=\"East_Central\",VLOOKUP('Seeding Plan'!$B47,EC_Dates,4,FALSE), IF('Seeding Plan'!$C$8=\"Southwest\",VLOOKUP('Seeding Plan'!$B47,SW_Dates,4,FALSE), IF('Seeding Plan'!$C$8=\"South_Central\",VLOOKUP('Seeding Plan'!$B47,SC_Dates,4,FALSE),IF('Seeding Plan'!$C$8=\"Southeast\",VLOOKUP('Seeding Plan'!$B47,SE_Dates,4,FALSE)))))))))))","v":""},{"$f":"IF('Seeding Plan'!$B47=\"\",\"\",IF('Seeding Plan'!$C$8=\"Northwest\",VLOOKUP('Seeding Plan'!$B47,NW_Dates,5,FALSE),IF('Seeding Plan'!$C$8=\"North_Central\",VLOOKUP('Seeding Plan'!$B47,NC_Dates,5,FALSE),IF('Seeding Plan'!$C$8=\"Northeast\",VLOOKUP('Seeding Plan'!$B47,NE_Dates,5,FALSE),IF('Seeding Plan'!$C$8=\"West_Central\",VLOOKUP('Seeding Plan'!$B47,WC_Dates,5,FALSE),IF('Seeding Plan'!$C$8=\"Central\",VLOOKUP('Seeding Plan'!$B47,C_Dates,5,FALSE), IF('Seeding Plan'!$C$8=\"East_Central\",VLOOKUP('Seeding Plan'!$B47,EC_Dates,5,FALSE), IF('Seeding Plan'!$C$8=\"Southwest\",VLOOKUP('Seeding Plan'!$B47,SW_Dates,5,FALSE), IF('Seeding Plan'!$C$8=\"South_Central\",VLOOKUP('Seeding Plan'!$B47,SC_Dates,5,FALSE),IF('Seeding Plan'!$C$8=\"Southeast\",VLOOKUP('Seeding Plan'!$B47,SE_Dates,5,FALSE)))))))))))","v":""},{"$f":"IF('Seeding Plan'!$B47=\"\",\"\",IF('Seeding Plan'!$C$8=\"Northwest\",VLOOKUP('Seeding Plan'!$B47,NW_Dates,6,FALSE),IF('Seeding Plan'!$C$8=\"North_Central\",VLOOKUP('Seeding Plan'!$B47,NC_Dates,6,FALSE),IF('Seeding Plan'!$C$8=\"Northeast\",VLOOKUP('Seeding Plan'!$B47,NE_Dates,6,FALSE),IF('Seeding Plan'!$C$8=\"West_Central\",VLOOKUP('Seeding Plan'!$B47,WC_Dates,6,FALSE),IF('Seeding Plan'!$C$8=\"Central\",VLOOKUP('Seeding Plan'!$B47,C_Dates,6,FALSE), IF('Seeding Plan'!$C$8=\"East_Central\",VLOOKUP('Seeding Plan'!$B47,EC_Dates,6,FALSE), IF('Seeding Plan'!$C$8=\"Southwest\",VLOOKUP('Seeding Plan'!$B47,SW_Dates,6,FALSE), IF('Seeding Plan'!$C$8=\"South_Central\",VLOOKUP('Seeding Plan'!$B47,SC_Dates,6,FALSE),IF('Seeding Plan'!$C$8=\"Southeast\",VLOOKUP('Seeding Plan'!$B47,SE_Dates,6,FALSE)))))))))))","v":""},{"$f":"IF('Seeding Plan'!$B47=\"\",\"\",IF('Seeding Plan'!$C$8=\"Northwest\",VLOOKUP('Seeding Plan'!$B47,NW_Dates,7,FALSE),IF('Seeding Plan'!$C$8=\"North_Central\",VLOOKUP('Seeding Plan'!$B47,NC_Dates,7,FALSE),IF('Seeding Plan'!$C$8=\"Northeast\",VLOOKUP('Seeding Plan'!$B47,NE_Dates,7,FALSE),IF('Seeding Plan'!$C$8=\"West_Central\",VLOOKUP('Seeding Plan'!$B47,WC_Dates,7,FALSE),IF('Seeding Plan'!$C$8=\"Central\",VLOOKUP('Seeding Plan'!$B47,C_Dates,7,FALSE), IF('Seeding Plan'!$C$8=\"East_Central\",VLOOKUP('Seeding Plan'!$B47,EC_Dates,7,FALSE), IF('Seeding Plan'!$C$8=\"Southwest\",VLOOKUP('Seeding Plan'!$B47,SW_Dates,7,FALSE), IF('Seeding Plan'!$C$8=\"South_Central\",VLOOKUP('Seeding Plan'!$B47,SC_Dates,7,FALSE),IF('Seeding Plan'!$C$8=\"Southeast\",VLOOKUP('Seeding Plan'!$B47,SE_Dates,7,FALSE)))))))))))","v":""},{"$f":"IF('Seeding Plan'!$B47=\"\",\"\",IF('Seeding Plan'!$C$8=\"Northwest\",VLOOKUP('Seeding Plan'!$B47,NW_Dates,8,FALSE),IF('Seeding Plan'!$C$8=\"North_Central\",VLOOKUP('Seeding Plan'!$B47,NC_Dates,8,FALSE),IF('Seeding Plan'!$C$8=\"Northeast\",VLOOKUP('Seeding Plan'!$B47,NE_Dates,8,FALSE),IF('Seeding Plan'!$C$8=\"West_Central\",VLOOKUP('Seeding Plan'!$B47,WC_Dates,8,FALSE),IF('Seeding Plan'!$C$8=\"Central\",VLOOKUP('Seeding Plan'!$B47,C_Dates,8,FALSE), IF('Seeding Plan'!$C$8=\"East_Central\",VLOOKUP('Seeding Plan'!$B47,EC_Dates,8,FALSE), IF('Seeding Plan'!$C$8=\"Southwest\",VLOOKUP('Seeding Plan'!$B47,SW_Dates,8,FALSE), IF('Seeding Plan'!$C$8=\"South_Central\",VLOOKUP('Seeding Plan'!$B47,SC_Dates,8,FALSE),IF('Seeding Plan'!$C$8=\"Southeast\",VLOOKUP('Seeding Plan'!$B47,SE_Dates,8,FALSE)))))))))))","v":""},{"$f":"IF('Seeding Plan'!$B47=\"\",\"\",IF('Seeding Plan'!$C$8=\"Northwest\",VLOOKUP('Seeding Plan'!$B47,NW_Dates,9,FALSE),IF('Seeding Plan'!$C$8=\"North_Central\",VLOOKUP('Seeding Plan'!$B47,NC_Dates,9,FALSE),IF('Seeding Plan'!$C$8=\"Northeast\",VLOOKUP('Seeding Plan'!$B47,NE_Dates,9,FALSE),IF('Seeding Plan'!$C$8=\"West_Central\",VLOOKUP('Seeding Plan'!$B47,WC_Dates,9,FALSE),IF('Seeding Plan'!$C$8=\"Central\",VLOOKUP('Seeding Plan'!$B47,C_Dates,9,FALSE), IF('Seeding Plan'!$C$8=\"East_Central\",VLOOKUP('Seeding Plan'!$B47,EC_Dates,9,FALSE), IF('Seeding Plan'!$C$8=\"Southwest\",VLOOKUP('Seeding Plan'!$B47,SW_Dates,9,FALSE), IF('Seeding Plan'!$C$8=\"South_Central\",VLOOKUP('Seeding Plan'!$B47,SC_Dates,9,FALSE),IF('Seeding Plan'!$C$8=\"Southeast\",VLOOKUP('Seeding Plan'!$B47,SE_Dates,9,FALSE)))))))))))","v":""}]
["Species","West Central",null,null,null,null,null,null,null,null,{"$f":"+'Seeding Plan'!B48","v":0},{"$f":"IF('Seeding Plan'!$B48=\"\",\"\",IF('Seeding Plan'!$C$8=\"Northwest\",VLOOKUP('Seeding Plan'!$B48,NW_Dates,2,FALSE),IF('Seeding Plan'!$C$8=\"North_Central\",VLOOKUP('Seeding Plan'!$B48,NC_Dates,2,FALSE),IF('Seeding Plan'!$C$8=\"Northeast\",VLOOKUP('Seeding Plan'!$B48,NE_Dates,2,FALSE),IF('Seeding Plan'!$C$8=\"West_Central\",VLOOKUP('Seeding Plan'!$B48,WC_Dates,2,FALSE),IF('Seeding Plan'!$C$8=\"Central\",VLOOKUP('Seeding Plan'!$B48,C_Dates,2,FALSE), IF('Seeding Plan'!$C$8=\"East_Central\",VLOOKUP('Seeding Plan'!$B48,EC_Dates,2,FALSE), IF('Seeding Plan'!$C$8=\"Southwest\",VLOOKUP('Seeding Plan'!$B48,SW_Dates,2,FALSE), IF('Seeding Plan'!$C$8=\"South_Central\",VLOOKUP('Seeding Plan'!$B48,SC_Dates,2,FALSE),IF('Seeding Plan'!$C$8=\"Southeast\",VLOOKUP('Seeding Plan'!$B48,SE_Dates,2,FALSE)))))))))))","v":""},{"$f":"IF('Seeding Plan'!B48=\"\",\"\",IF('Seeding Plan'!$C$8=\"Northwest\",VLOOKUP('Seeding Plan'!$B48,NW_Dates,3,FALSE),IF('Seeding Plan'!$C$8=\"North_Central\",VLOOKUP('Seeding Plan'!$B48,NC_Dates,3,FALSE),IF('Seeding Plan'!$C$8=\"Northeast\",VLOOKUP('Seeding Plan'!$B48,NE_Dates,3,FALSE),IF('Seeding Plan'!$C$8=\"West_Central\",VLOOKUP('Seeding Plan'!$B48,WC_Dates,3,FALSE),IF('Seeding Plan'!$C$8=\"Central\",VLOOKUP('Seeding Plan'!$B48,C_Dates,3,FALSE), IF('Seeding Plan'!$C$8=\"East_Central\",VLOOKUP('Seeding Plan'!$B48,EC_Dates,3,FALSE), IF('Seeding Plan'!$C$8=\"Southwest\",VLOOKUP('Seeding Plan'!$B48,SW_Dates,3,FALSE), IF('Seeding Plan'!$C$8=\"South_Central\",VLOOKUP('Seeding Plan'!$B48,SC_Dates,3,FALSE),IF('Seeding Plan'!$C$8=\"Southeast\",VLOOKUP('Seeding Plan'!$B48,SE_Dates,3,FALSE)))))))))))","v":""},{"$f":"IF('Seeding Plan'!$B48=\"\",\"\",IF('Seeding Plan'!$C$8=\"Northwest\",VLOOKUP('Seeding Plan'!$B48,NW_Dates,4,FALSE),IF('Seeding Plan'!$C$8=\"North_Central\",VLOOKUP('Seeding Plan'!$B48,NC_Dates,4,FALSE),IF('Seeding Plan'!$C$8=\"Northeast\",VLOOKUP('Seeding Plan'!$B48,NE_Dates,4,FALSE),IF('Seeding Plan'!$C$8=\"West_Central\",VLOOKUP('Seeding Plan'!$B48,WC_Dates,4,FALSE),IF('Seeding Plan'!$C$8=\"Central\",VLOOKUP('Seeding Plan'!$B48,C_Dates,4,FALSE), IF('Seeding Plan'!$C$8=\"East_Central\",VLOOKUP('Seeding Plan'!$B48,EC_Dates,4,FALSE), IF('Seeding Plan'!$C$8=\"Southwest\",VLOOKUP('Seeding Plan'!$B48,SW_Dates,4,FALSE), IF('Seeding Plan'!$C$8=\"South_Central\",VLOOKUP('Seeding Plan'!$B48,SC_Dates,4,FALSE),IF('Seeding Plan'!$C$8=\"Southeast\",VLOOKUP('Seeding Plan'!$B48,SE_Dates,4,FALSE)))))))))))","v":""},{"$f":"IF('Seeding Plan'!$B48=\"\",\"\",IF('Seeding Plan'!$C$8=\"Northwest\",VLOOKUP('Seeding Plan'!$B48,NW_Dates,5,FALSE),IF('Seeding Plan'!$C$8=\"North_Central\",VLOOKUP('Seeding Plan'!$B48,NC_Dates,5,FALSE),IF('Seeding Plan'!$C$8=\"Northeast\",VLOOKUP('Seeding Plan'!$B48,NE_Dates,5,FALSE),IF('Seeding Plan'!$C$8=\"West_Central\",VLOOKUP('Seeding Plan'!$B48,WC_Dates,5,FALSE),IF('Seeding Plan'!$C$8=\"Central\",VLOOKUP('Seeding Plan'!$B48,C_Dates,5,FALSE), IF('Seeding Plan'!$C$8=\"East_Central\",VLOOKUP('Seeding Plan'!$B48,EC_Dates,5,FALSE), IF('Seeding Plan'!$C$8=\"Southwest\",VLOOKUP('Seeding Plan'!$B48,SW_Dates,5,FALSE), IF('Seeding Plan'!$C$8=\"South_Central\",VLOOKUP('Seeding Plan'!$B48,SC_Dates,5,FALSE),IF('Seeding Plan'!$C$8=\"Southeast\",VLOOKUP('Seeding Plan'!$B48,SE_Dates,5,FALSE)))))))))))","v":""},{"$f":"IF('Seeding Plan'!$B48=\"\",\"\",IF('Seeding Plan'!$C$8=\"Northwest\",VLOOKUP('Seeding Plan'!$B48,NW_Dates,6,FALSE),IF('Seeding Plan'!$C$8=\"North_Central\",VLOOKUP('Seeding Plan'!$B48,NC_Dates,6,FALSE),IF('Seeding Plan'!$C$8=\"Northeast\",VLOOKUP('Seeding Plan'!$B48,NE_Dates,6,FALSE),IF('Seeding Plan'!$C$8=\"West_Central\",VLOOKUP('Seeding Plan'!$B48,WC_Dates,6,FALSE),IF('Seeding Plan'!$C$8=\"Central\",VLOOKUP('Seeding Plan'!$B48,C_Dates,6,FALSE), IF('Seeding Plan'!$C$8=\"East_Central\",VLOOKUP('Seeding Plan'!$B48,EC_Dates,6,FALSE), IF('Seeding Plan'!$C$8=\"Southwest\",VLOOKUP('Seeding Plan'!$B48,SW_Dates,6,FALSE), IF('Seeding Plan'!$C$8=\"South_Central\",VLOOKUP('Seeding Plan'!$B48,SC_Dates,6,FALSE),IF('Seeding Plan'!$C$8=\"Southeast\",VLOOKUP('Seeding Plan'!$B48,SE_Dates,6,FALSE)))))))))))","v":""},{"$f":"IF('Seeding Plan'!$B48=\"\",\"\",IF('Seeding Plan'!$C$8=\"Northwest\",VLOOKUP('Seeding Plan'!$B48,NW_Dates,7,FALSE),IF('Seeding Plan'!$C$8=\"North_Central\",VLOOKUP('Seeding Plan'!$B48,NC_Dates,7,FALSE),IF('Seeding Plan'!$C$8=\"Northeast\",VLOOKUP('Seeding Plan'!$B48,NE_Dates,7,FALSE),IF('Seeding Plan'!$C$8=\"West_Central\",VLOOKUP('Seeding Plan'!$B48,WC_Dates,7,FALSE),IF('Seeding Plan'!$C$8=\"Central\",VLOOKUP('Seeding Plan'!$B48,C_Dates,7,FALSE), IF('Seeding Plan'!$C$8=\"East_Central\",VLOOKUP('Seeding Plan'!$B48,EC_Dates,7,FALSE), IF('Seeding Plan'!$C$8=\"Southwest\",VLOOKUP('Seeding Plan'!$B48,SW_Dates,7,FALSE), IF('Seeding Plan'!$C$8=\"South_Central\",VLOOKUP('Seeding Plan'!$B48,SC_Dates,7,FALSE),IF('Seeding Plan'!$C$8=\"Southeast\",VLOOKUP('Seeding Plan'!$B48,SE_Dates,7,FALSE)))))))))))","v":""},{"$f":"IF('Seeding Plan'!$B48=\"\",\"\",IF('Seeding Plan'!$C$8=\"Northwest\",VLOOKUP('Seeding Plan'!$B48,NW_Dates,8,FALSE),IF('Seeding Plan'!$C$8=\"North_Central\",VLOOKUP('Seeding Plan'!$B48,NC_Dates,8,FALSE),IF('Seeding Plan'!$C$8=\"Northeast\",VLOOKUP('Seeding Plan'!$B48,NE_Dates,8,FALSE),IF('Seeding Plan'!$C$8=\"West_Central\",VLOOKUP('Seeding Plan'!$B48,WC_Dates,8,FALSE),IF('Seeding Plan'!$C$8=\"Central\",VLOOKUP('Seeding Plan'!$B48,C_Dates,8,FALSE), IF('Seeding Plan'!$C$8=\"East_Central\",VLOOKUP('Seeding Plan'!$B48,EC_Dates,8,FALSE), IF('Seeding Plan'!$C$8=\"Southwest\",VLOOKUP('Seeding Plan'!$B48,SW_Dates,8,FALSE), IF('Seeding Plan'!$C$8=\"South_Central\",VLOOKUP('Seeding Plan'!$B48,SC_Dates,8,FALSE),IF('Seeding Plan'!$C$8=\"Southeast\",VLOOKUP('Seeding Plan'!$B48,SE_Dates,8,FALSE)))))))))))","v":""},{"$f":"IF('Seeding Plan'!$B48=\"\",\"\",IF('Seeding Plan'!$C$8=\"Northwest\",VLOOKUP('Seeding Plan'!$B48,NW_Dates,9,FALSE),IF('Seeding Plan'!$C$8=\"North_Central\",VLOOKUP('Seeding Plan'!$B48,NC_Dates,9,FALSE),IF('Seeding Plan'!$C$8=\"Northeast\",VLOOKUP('Seeding Plan'!$B48,NE_Dates,9,FALSE),IF('Seeding Plan'!$C$8=\"West_Central\",VLOOKUP('Seeding Plan'!$B48,WC_Dates,9,FALSE),IF('Seeding Plan'!$C$8=\"Central\",VLOOKUP('Seeding Plan'!$B48,C_Dates,9,FALSE), IF('Seeding Plan'!$C$8=\"East_Central\",VLOOKUP('Seeding Plan'!$B48,EC_Dates,9,FALSE), IF('Seeding Plan'!$C$8=\"Southwest\",VLOOKUP('Seeding Plan'!$B48,SW_Dates,9,FALSE), IF('Seeding Plan'!$C$8=\"South_Central\",VLOOKUP('Seeding Plan'!$B48,SC_Dates,9,FALSE),IF('Seeding Plan'!$C$8=\"Southeast\",VLOOKUP('Seeding Plan'!$B48,SE_Dates,9,FALSE)))))))))))","v":""}]
[null,"Spring ",null,null,null,"Fall",null,null,null,null,{"$f":"+'Seeding Plan'!B49","v":0},{"$f":"IF('Seeding Plan'!$B49=\"\",\"\",IF('Seeding Plan'!$C$8=\"Northwest\",VLOOKUP('Seeding Plan'!$B49,NW_Dates,2,FALSE),IF('Seeding Plan'!$C$8=\"North_Central\",VLOOKUP('Seeding Plan'!$B49,NC_Dates,2,FALSE),IF('Seeding Plan'!$C$8=\"Northeast\",VLOOKUP('Seeding Plan'!$B49,NE_Dates,2,FALSE),IF('Seeding Plan'!$C$8=\"West_Central\",VLOOKUP('Seeding Plan'!$B49,WC_Dates,2,FALSE),IF('Seeding Plan'!$C$8=\"Central\",VLOOKUP('Seeding Plan'!$B49,C_Dates,2,FALSE), IF('Seeding Plan'!$C$8=\"East_Central\",VLOOKUP('Seeding Plan'!$B49,EC_Dates,2,FALSE), IF('Seeding Plan'!$C$8=\"Southwest\",VLOOKUP('Seeding Plan'!$B49,SW_Dates,2,FALSE), IF('Seeding Plan'!$C$8=\"South_Central\",VLOOKUP('Seeding Plan'!$B49,SC_Dates,2,FALSE),IF('Seeding Plan'!$C$8=\"Southeast\",VLOOKUP('Seeding Plan'!$B49,SE_Dates,2,FALSE)))))))))))","v":""},{"$f":"IF('Seeding Plan'!B49=\"\",\"\",IF('Seeding Plan'!$C$8=\"Northwest\",VLOOKUP('Seeding Plan'!$B49,NW_Dates,3,FALSE),IF('Seeding Plan'!$C$8=\"North_Central\",VLOOKUP('Seeding Plan'!$B49,NC_Dates,3,FALSE),IF('Seeding Plan'!$C$8=\"Northeast\",VLOOKUP('Seeding Plan'!$B49,NE_Dates,3,FALSE),IF('Seeding Plan'!$C$8=\"West_Central\",VLOOKUP('Seeding Plan'!$B49,WC_Dates,3,FALSE),IF('Seeding Plan'!$C$8=\"Central\",VLOOKUP('Seeding Plan'!$B49,C_Dates,3,FALSE), IF('Seeding Plan'!$C$8=\"East_Central\",VLOOKUP('Seeding Plan'!$B49,EC_Dates,3,FALSE), IF('Seeding Plan'!$C$8=\"Southwest\",VLOOKUP('Seeding Plan'!$B49,SW_Dates,3,FALSE), IF('Seeding Plan'!$C$8=\"South_Central\",VLOOKUP('Seeding Plan'!$B49,SC_Dates,3,FALSE),IF('Seeding Plan'!$C$8=\"Southeast\",VLOOKUP('Seeding Plan'!$B49,SE_Dates,3,FALSE)))))))))))","v":""},{"$f":"IF('Seeding Plan'!$B49=\"\",\"\",IF('Seeding Plan'!$C$8=\"Northwest\",VLOOKUP('Seeding Plan'!$B49,NW_Dates,4,FALSE),IF('Seeding Plan'!$C$8=\"North_Central\",VLOOKUP('Seeding Plan'!$B49,NC_Dates,4,FALSE),IF('Seeding Plan'!$C$8=\"Northeast\",VLOOKUP('Seeding Plan'!$B49,NE_Dates,4,FALSE),IF('Seeding Plan'!$C$8=\"West_Central\",VLOOKUP('Seeding Plan'!$B49,WC_Dates,4,FALSE),IF('Seeding Plan'!$C$8=\"Central\",VLOOKUP('Seeding Plan'!$B49,C_Dates,4,FALSE), IF('Seeding Plan'!$C$8=\"East_Central\",VLOOKUP('Seeding Plan'!$B49,EC_Dates,4,FALSE), IF('Seeding Plan'!$C$8=\"Southwest\",VLOOKUP('Seeding Plan'!$B49,SW_Dates,4,FALSE), IF('Seeding Plan'!$C$8=\"South_Central\",VLOOKUP('Seeding Plan'!$B49,SC_Dates,4,FALSE),IF('Seeding Plan'!$C$8=\"Southeast\",VLOOKUP('Seeding Plan'!$B49,SE_Dates,4,FALSE)))))))))))","v":""},{"$f":"IF('Seeding Plan'!$B49=\"\",\"\",IF('Seeding Plan'!$C$8=\"Northwest\",VLOOKUP('Seeding Plan'!$B49,NW_Dates,5,FALSE),IF('Seeding Plan'!$C$8=\"North_Central\",VLOOKUP('Seeding Plan'!$B49,NC_Dates,5,FALSE),IF('Seeding Plan'!$C$8=\"Northeast\",VLOOKUP('Seeding Plan'!$B49,NE_Dates,5,FALSE),IF('Seeding Plan'!$C$8=\"West_Central\",VLOOKUP('Seeding Plan'!$B49,WC_Dates,5,FALSE),IF('Seeding Plan'!$C$8=\"Central\",VLOOKUP('Seeding Plan'!$B49,C_Dates,5,FALSE), IF('Seeding Plan'!$C$8=\"East_Central\",VLOOKUP('Seeding Plan'!$B49,EC_Dates,5,FALSE), IF('Seeding Plan'!$C$8=\"Southwest\",VLOOKUP('Seeding Plan'!$B49,SW_Dates,5,FALSE), IF('Seeding Plan'!$C$8=\"South_Central\",VLOOKUP('Seeding Plan'!$B49,SC_Dates,5,FALSE),IF('Seeding Plan'!$C$8=\"Southeast\",VLOOKUP('Seeding Plan'!$B49,SE_Dates,5,FALSE)))))))))))","v":""},{"$f":"IF('Seeding Plan'!$B49=\"\",\"\",IF('Seeding Plan'!$C$8=\"Northwest\",VLOOKUP('Seeding Plan'!$B49,NW_Dates,6,FALSE),IF('Seeding Plan'!$C$8=\"North_Central\",VLOOKUP('Seeding Plan'!$B49,NC_Dates,6,FALSE),IF('Seeding Plan'!$C$8=\"Northeast\",VLOOKUP('Seeding Plan'!$B49,NE_Dates,6,FALSE),IF('Seeding Plan'!$C$8=\"West_Central\",VLOOKUP('Seeding Plan'!$B49,WC_Dates,6,FALSE),IF('Seeding Plan'!$C$8=\"Central\",VLOOKUP('Seeding Plan'!$B49,C_Dates,6,FALSE), IF('Seeding Plan'!$C$8=\"East_Central\",VLOOKUP('Seeding Plan'!$B49,EC_Dates,6,FALSE), IF('Seeding Plan'!$C$8=\"Southwest\",VLOOKUP('Seeding Plan'!$B49,SW_Dates,6,FALSE), IF('Seeding Plan'!$C$8=\"South_Central\",VLOOKUP('Seeding Plan'!$B49,SC_Dates,6,FALSE),IF('Seeding Plan'!$C$8=\"Southeast\",VLOOKUP('Seeding Plan'!$B49,SE_Dates,6,FALSE)))))))))))","v":""},{"$f":"IF('Seeding Plan'!$B49=\"\",\"\",IF('Seeding Plan'!$C$8=\"Northwest\",VLOOKUP('Seeding Plan'!$B49,NW_Dates,7,FALSE),IF('Seeding Plan'!$C$8=\"North_Central\",VLOOKUP('Seeding Plan'!$B49,NC_Dates,7,FALSE),IF('Seeding Plan'!$C$8=\"Northeast\",VLOOKUP('Seeding Plan'!$B49,NE_Dates,7,FALSE),IF('Seeding Plan'!$C$8=\"West_Central\",VLOOKUP('Seeding Plan'!$B49,WC_Dates,7,FALSE),IF('Seeding Plan'!$C$8=\"Central\",VLOOKUP('Seeding Plan'!$B49,C_Dates,7,FALSE), IF('Seeding Plan'!$C$8=\"East_Central\",VLOOKUP('Seeding Plan'!$B49,EC_Dates,7,FALSE), IF('Seeding Plan'!$C$8=\"Southwest\",VLOOKUP('Seeding Plan'!$B49,SW_Dates,7,FALSE), IF('Seeding Plan'!$C$8=\"South_Central\",VLOOKUP('Seeding Plan'!$B49,SC_Dates,7,FALSE),IF('Seeding Plan'!$C$8=\"Southeast\",VLOOKUP('Seeding Plan'!$B49,SE_Dates,7,FALSE)))))))))))","v":""},{"$f":"IF('Seeding Plan'!$B49=\"\",\"\",IF('Seeding Plan'!$C$8=\"Northwest\",VLOOKUP('Seeding Plan'!$B49,NW_Dates,8,FALSE),IF('Seeding Plan'!$C$8=\"North_Central\",VLOOKUP('Seeding Plan'!$B49,NC_Dates,8,FALSE),IF('Seeding Plan'!$C$8=\"Northeast\",VLOOKUP('Seeding Plan'!$B49,NE_Dates,8,FALSE),IF('Seeding Plan'!$C$8=\"West_Central\",VLOOKUP('Seeding Plan'!$B49,WC_Dates,8,FALSE),IF('Seeding Plan'!$C$8=\"Central\",VLOOKUP('Seeding Plan'!$B49,C_Dates,8,FALSE), IF('Seeding Plan'!$C$8=\"East_Central\",VLOOKUP('Seeding Plan'!$B49,EC_Dates,8,FALSE), IF('Seeding Plan'!$C$8=\"Southwest\",VLOOKUP('Seeding Plan'!$B49,SW_Dates,8,FALSE), IF('Seeding Plan'!$C$8=\"South_Central\",VLOOKUP('Seeding Plan'!$B49,SC_Dates,8,FALSE),IF('Seeding Plan'!$C$8=\"Southeast\",VLOOKUP('Seeding Plan'!$B49,SE_Dates,8,FALSE)))))))))))","v":""},{"$f":"IF('Seeding Plan'!$B49=\"\",\"\",IF('Seeding Plan'!$C$8=\"Northwest\",VLOOKUP('Seeding Plan'!$B49,NW_Dates,9,FALSE),IF('Seeding Plan'!$C$8=\"North_Central\",VLOOKUP('Seeding Plan'!$B49,NC_Dates,9,FALSE),IF('Seeding Plan'!$C$8=\"Northeast\",VLOOKUP('Seeding Plan'!$B49,NE_Dates,9,FALSE),IF('Seeding Plan'!$C$8=\"West_Central\",VLOOKUP('Seeding Plan'!$B49,WC_Dates,9,FALSE),IF('Seeding Plan'!$C$8=\"Central\",VLOOKUP('Seeding Plan'!$B49,C_Dates,9,FALSE), IF('Seeding Plan'!$C$8=\"East_Central\",VLOOKUP('Seeding Plan'!$B49,EC_Dates,9,FALSE), IF('Seeding Plan'!$C$8=\"Southwest\",VLOOKUP('Seeding Plan'!$B49,SW_Dates,9,FALSE), IF('Seeding Plan'!$C$8=\"South_Central\",VLOOKUP('Seeding Plan'!$B49,SC_Dates,9,FALSE),IF('Seeding Plan'!$C$8=\"Southeast\",VLOOKUP('Seeding Plan'!$B49,SE_Dates,9,FALSE)))))))))))","v":""}]
["Barley, Spring","2021-03-18","2021-04-01","2021-04-28","2021-05-25","2021-08-06","2021-08-20","2021-09-09","2021-09-22",null,{"$f":"+'Seeding Plan'!B50","v":0},{"$f":"IF('Seeding Plan'!$B50=\"\",\"\",IF('Seeding Plan'!$C$8=\"Northwest\",VLOOKUP('Seeding Plan'!$B50,NW_Dates,2,FALSE),IF('Seeding Plan'!$C$8=\"North_Central\",VLOOKUP('Seeding Plan'!$B50,NC_Dates,2,FALSE),IF('Seeding Plan'!$C$8=\"Northeast\",VLOOKUP('Seeding Plan'!$B50,NE_Dates,2,FALSE),IF('Seeding Plan'!$C$8=\"West_Central\",VLOOKUP('Seeding Plan'!$B50,WC_Dates,2,FALSE),IF('Seeding Plan'!$C$8=\"Central\",VLOOKUP('Seeding Plan'!$B50,C_Dates,2,FALSE), IF('Seeding Plan'!$C$8=\"East_Central\",VLOOKUP('Seeding Plan'!$B50,EC_Dates,2,FALSE), IF('Seeding Plan'!$C$8=\"Southwest\",VLOOKUP('Seeding Plan'!$B50,SW_Dates,2,FALSE), IF('Seeding Plan'!$C$8=\"South_Central\",VLOOKUP('Seeding Plan'!$B50,SC_Dates,2,FALSE),IF('Seeding Plan'!$C$8=\"Southeast\",VLOOKUP('Seeding Plan'!$B50,SE_Dates,2,FALSE)))))))))))","v":""},{"$f":"IF('Seeding Plan'!B50=\"\",\"\",IF('Seeding Plan'!$C$8=\"Northwest\",VLOOKUP('Seeding Plan'!$B50,NW_Dates,3,FALSE),IF('Seeding Plan'!$C$8=\"North_Central\",VLOOKUP('Seeding Plan'!$B50,NC_Dates,3,FALSE),IF('Seeding Plan'!$C$8=\"Northeast\",VLOOKUP('Seeding Plan'!$B50,NE_Dates,3,FALSE),IF('Seeding Plan'!$C$8=\"West_Central\",VLOOKUP('Seeding Plan'!$B50,WC_Dates,3,FALSE),IF('Seeding Plan'!$C$8=\"Central\",VLOOKUP('Seeding Plan'!$B50,C_Dates,3,FALSE), IF('Seeding Plan'!$C$8=\"East_Central\",VLOOKUP('Seeding Plan'!$B50,EC_Dates,3,FALSE), IF('Seeding Plan'!$C$8=\"Southwest\",VLOOKUP('Seeding Plan'!$B50,SW_Dates,3,FALSE), IF('Seeding Plan'!$C$8=\"South_Central\",VLOOKUP('Seeding Plan'!$B50,SC_Dates,3,FALSE),IF('Seeding Plan'!$C$8=\"Southeast\",VLOOKUP('Seeding Plan'!$B50,SE_Dates,3,FALSE)))))))))))","v":""},{"$f":"IF('Seeding Plan'!$B50=\"\",\"\",IF('Seeding Plan'!$C$8=\"Northwest\",VLOOKUP('Seeding Plan'!$B50,NW_Dates,4,FALSE),IF('Seeding Plan'!$C$8=\"North_Central\",VLOOKUP('Seeding Plan'!$B50,NC_Dates,4,FALSE),IF('Seeding Plan'!$C$8=\"Northeast\",VLOOKUP('Seeding Plan'!$B50,NE_Dates,4,FALSE),IF('Seeding Plan'!$C$8=\"West_Central\",VLOOKUP('Seeding Plan'!$B50,WC_Dates,4,FALSE),IF('Seeding Plan'!$C$8=\"Central\",VLOOKUP('Seeding Plan'!$B50,C_Dates,4,FALSE), IF('Seeding Plan'!$C$8=\"East_Central\",VLOOKUP('Seeding Plan'!$B50,EC_Dates,4,FALSE), IF('Seeding Plan'!$C$8=\"Southwest\",VLOOKUP('Seeding Plan'!$B50,SW_Dates,4,FALSE), IF('Seeding Plan'!$C$8=\"South_Central\",VLOOKUP('Seeding Plan'!$B50,SC_Dates,4,FALSE),IF('Seeding Plan'!$C$8=\"Southeast\",VLOOKUP('Seeding Plan'!$B50,SE_Dates,4,FALSE)))))))))))","v":""},{"$f":"IF('Seeding Plan'!$B50=\"\",\"\",IF('Seeding Plan'!$C$8=\"Northwest\",VLOOKUP('Seeding Plan'!$B50,NW_Dates,5,FALSE),IF('Seeding Plan'!$C$8=\"North_Central\",VLOOKUP('Seeding Plan'!$B50,NC_Dates,5,FALSE),IF('Seeding Plan'!$C$8=\"Northeast\",VLOOKUP('Seeding Plan'!$B50,NE_Dates,5,FALSE),IF('Seeding Plan'!$C$8=\"West_Central\",VLOOKUP('Seeding Plan'!$B50,WC_Dates,5,FALSE),IF('Seeding Plan'!$C$8=\"Central\",VLOOKUP('Seeding Plan'!$B50,C_Dates,5,FALSE), IF('Seeding Plan'!$C$8=\"East_Central\",VLOOKUP('Seeding Plan'!$B50,EC_Dates,5,FALSE), IF('Seeding Plan'!$C$8=\"Southwest\",VLOOKUP('Seeding Plan'!$B50,SW_Dates,5,FALSE), IF('Seeding Plan'!$C$8=\"South_Central\",VLOOKUP('Seeding Plan'!$B50,SC_Dates,5,FALSE),IF('Seeding Plan'!$C$8=\"Southeast\",VLOOKUP('Seeding Plan'!$B50,SE_Dates,5,FALSE)))))))))))","v":""},{"$f":"IF('Seeding Plan'!$B50=\"\",\"\",IF('Seeding Plan'!$C$8=\"Northwest\",VLOOKUP('Seeding Plan'!$B50,NW_Dates,6,FALSE),IF('Seeding Plan'!$C$8=\"North_Central\",VLOOKUP('Seeding Plan'!$B50,NC_Dates,6,FALSE),IF('Seeding Plan'!$C$8=\"Northeast\",VLOOKUP('Seeding Plan'!$B50,NE_Dates,6,FALSE),IF('Seeding Plan'!$C$8=\"West_Central\",VLOOKUP('Seeding Plan'!$B50,WC_Dates,6,FALSE),IF('Seeding Plan'!$C$8=\"Central\",VLOOKUP('Seeding Plan'!$B50,C_Dates,6,FALSE), IF('Seeding Plan'!$C$8=\"East_Central\",VLOOKUP('Seeding Plan'!$B50,EC_Dates,6,FALSE), IF('Seeding Plan'!$C$8=\"Southwest\",VLOOKUP('Seeding Plan'!$B50,SW_Dates,6,FALSE), IF('Seeding Plan'!$C$8=\"South_Central\",VLOOKUP('Seeding Plan'!$B50,SC_Dates,6,FALSE),IF('Seeding Plan'!$C$8=\"Southeast\",VLOOKUP('Seeding Plan'!$B50,SE_Dates,6,FALSE)))))))))))","v":""},{"$f":"IF('Seeding Plan'!$B50=\"\",\"\",IF('Seeding Plan'!$C$8=\"Northwest\",VLOOKUP('Seeding Plan'!$B50,NW_Dates,7,FALSE),IF('Seeding Plan'!$C$8=\"North_Central\",VLOOKUP('Seeding Plan'!$B50,NC_Dates,7,FALSE),IF('Seeding Plan'!$C$8=\"Northeast\",VLOOKUP('Seeding Plan'!$B50,NE_Dates,7,FALSE),IF('Seeding Plan'!$C$8=\"West_Central\",VLOOKUP('Seeding Plan'!$B50,WC_Dates,7,FALSE),IF('Seeding Plan'!$C$8=\"Central\",VLOOKUP('Seeding Plan'!$B50,C_Dates,7,FALSE), IF('Seeding Plan'!$C$8=\"East_Central\",VLOOKUP('Seeding Plan'!$B50,EC_Dates,7,FALSE), IF('Seeding Plan'!$C$8=\"Southwest\",VLOOKUP('Seeding Plan'!$B50,SW_Dates,7,FALSE), IF('Seeding Plan'!$C$8=\"South_Central\",VLOOKUP('Seeding Plan'!$B50,SC_Dates,7,FALSE),IF('Seeding Plan'!$C$8=\"Southeast\",VLOOKUP('Seeding Plan'!$B50,SE_Dates,7,FALSE)))))))))))","v":""},{"$f":"IF('Seeding Plan'!$B50=\"\",\"\",IF('Seeding Plan'!$C$8=\"Northwest\",VLOOKUP('Seeding Plan'!$B50,NW_Dates,8,FALSE),IF('Seeding Plan'!$C$8=\"North_Central\",VLOOKUP('Seeding Plan'!$B50,NC_Dates,8,FALSE),IF('Seeding Plan'!$C$8=\"Northeast\",VLOOKUP('Seeding Plan'!$B50,NE_Dates,8,FALSE),IF('Seeding Plan'!$C$8=\"West_Central\",VLOOKUP('Seeding Plan'!$B50,WC_Dates,8,FALSE),IF('Seeding Plan'!$C$8=\"Central\",VLOOKUP('Seeding Plan'!$B50,C_Dates,8,FALSE), IF('Seeding Plan'!$C$8=\"East_Central\",VLOOKUP('Seeding Plan'!$B50,EC_Dates,8,FALSE), IF('Seeding Plan'!$C$8=\"Southwest\",VLOOKUP('Seeding Plan'!$B50,SW_Dates,8,FALSE), IF('Seeding Plan'!$C$8=\"South_Central\",VLOOKUP('Seeding Plan'!$B50,SC_Dates,8,FALSE),IF('Seeding Plan'!$C$8=\"Southeast\",VLOOKUP('Seeding Plan'!$B50,SE_Dates,8,FALSE)))))))))))","v":""},{"$f":"IF('Seeding Plan'!$B50=\"\",\"\",IF('Seeding Plan'!$C$8=\"Northwest\",VLOOKUP('Seeding Plan'!$B50,NW_Dates,9,FALSE),IF('Seeding Plan'!$C$8=\"North_Central\",VLOOKUP('Seeding Plan'!$B50,NC_Dates,9,FALSE),IF('Seeding Plan'!$C$8=\"Northeast\",VLOOKUP('Seeding Plan'!$B50,NE_Dates,9,FALSE),IF('Seeding Plan'!$C$8=\"West_Central\",VLOOKUP('Seeding Plan'!$B50,WC_Dates,9,FALSE),IF('Seeding Plan'!$C$8=\"Central\",VLOOKUP('Seeding Plan'!$B50,C_Dates,9,FALSE), IF('Seeding Plan'!$C$8=\"East_Central\",VLOOKUP('Seeding Plan'!$B50,EC_Dates,9,FALSE), IF('Seeding Plan'!$C$8=\"Southwest\",VLOOKUP('Seeding Plan'!$B50,SW_Dates,9,FALSE), IF('Seeding Plan'!$C$8=\"South_Central\",VLOOKUP('Seeding Plan'!$B50,SC_Dates,9,FALSE),IF('Seeding Plan'!$C$8=\"Southeast\",VLOOKUP('Seeding Plan'!$B50,SE_Dates,9,FALSE)))))))))))","v":""}]
["Barley, Winter","-","-","-","-","2021-08-06","2021-08-20","2021-09-09","2021-09-22",null,{"$f":"+'Seeding Plan'!B51","v":0},{"$f":"IF('Seeding Plan'!$B51=\"\",\"\",IF('Seeding Plan'!$C$8=\"Northwest\",VLOOKUP('Seeding Plan'!$B51,NW_Dates,2,FALSE),IF('Seeding Plan'!$C$8=\"North_Central\",VLOOKUP('Seeding Plan'!$B51,NC_Dates,2,FALSE),IF('Seeding Plan'!$C$8=\"Northeast\",VLOOKUP('Seeding Plan'!$B51,NE_Dates,2,FALSE),IF('Seeding Plan'!$C$8=\"West_Central\",VLOOKUP('Seeding Plan'!$B51,WC_Dates,2,FALSE),IF('Seeding Plan'!$C$8=\"Central\",VLOOKUP('Seeding Plan'!$B51,C_Dates,2,FALSE), IF('Seeding Plan'!$C$8=\"East_Central\",VLOOKUP('Seeding Plan'!$B51,EC_Dates,2,FALSE), IF('Seeding Plan'!$C$8=\"Southwest\",VLOOKUP('Seeding Plan'!$B51,SW_Dates,2,FALSE), IF('Seeding Plan'!$C$8=\"South_Central\",VLOOKUP('Seeding Plan'!$B51,SC_Dates,2,FALSE),IF('Seeding Plan'!$C$8=\"Southeast\",VLOOKUP('Seeding Plan'!$B51,SE_Dates,2,FALSE)))))))))))","v":""},{"$f":"IF('Seeding Plan'!B51=\"\",\"\",IF('Seeding Plan'!$C$8=\"Northwest\",VLOOKUP('Seeding Plan'!$B51,NW_Dates,3,FALSE),IF('Seeding Plan'!$C$8=\"North_Central\",VLOOKUP('Seeding Plan'!$B51,NC_Dates,3,FALSE),IF('Seeding Plan'!$C$8=\"Northeast\",VLOOKUP('Seeding Plan'!$B51,NE_Dates,3,FALSE),IF('Seeding Plan'!$C$8=\"West_Central\",VLOOKUP('Seeding Plan'!$B51,WC_Dates,3,FALSE),IF('Seeding Plan'!$C$8=\"Central\",VLOOKUP('Seeding Plan'!$B51,C_Dates,3,FALSE), IF('Seeding Plan'!$C$8=\"East_Central\",VLOOKUP('Seeding Plan'!$B51,EC_Dates,3,FALSE), IF('Seeding Plan'!$C$8=\"Southwest\",VLOOKUP('Seeding Plan'!$B51,SW_Dates,3,FALSE), IF('Seeding Plan'!$C$8=\"South_Central\",VLOOKUP('Seeding Plan'!$B51,SC_Dates,3,FALSE),IF('Seeding Plan'!$C$8=\"Southeast\",VLOOKUP('Seeding Plan'!$B51,SE_Dates,3,FALSE)))))))))))","v":""},{"$f":"IF('Seeding Plan'!$B51=\"\",\"\",IF('Seeding Plan'!$C$8=\"Northwest\",VLOOKUP('Seeding Plan'!$B51,NW_Dates,4,FALSE),IF('Seeding Plan'!$C$8=\"North_Central\",VLOOKUP('Seeding Plan'!$B51,NC_Dates,4,FALSE),IF('Seeding Plan'!$C$8=\"Northeast\",VLOOKUP('Seeding Plan'!$B51,NE_Dates,4,FALSE),IF('Seeding Plan'!$C$8=\"West_Central\",VLOOKUP('Seeding Plan'!$B51,WC_Dates,4,FALSE),IF('Seeding Plan'!$C$8=\"Central\",VLOOKUP('Seeding Plan'!$B51,C_Dates,4,FALSE), IF('Seeding Plan'!$C$8=\"East_Central\",VLOOKUP('Seeding Plan'!$B51,EC_Dates,4,FALSE), IF('Seeding Plan'!$C$8=\"Southwest\",VLOOKUP('Seeding Plan'!$B51,SW_Dates,4,FALSE), IF('Seeding Plan'!$C$8=\"South_Central\",VLOOKUP('Seeding Plan'!$B51,SC_Dates,4,FALSE),IF('Seeding Plan'!$C$8=\"Southeast\",VLOOKUP('Seeding Plan'!$B51,SE_Dates,4,FALSE)))))))))))","v":""},{"$f":"IF('Seeding Plan'!$B51=\"\",\"\",IF('Seeding Plan'!$C$8=\"Northwest\",VLOOKUP('Seeding Plan'!$B51,NW_Dates,5,FALSE),IF('Seeding Plan'!$C$8=\"North_Central\",VLOOKUP('Seeding Plan'!$B51,NC_Dates,5,FALSE),IF('Seeding Plan'!$C$8=\"Northeast\",VLOOKUP('Seeding Plan'!$B51,NE_Dates,5,FALSE),IF('Seeding Plan'!$C$8=\"West_Central\",VLOOKUP('Seeding Plan'!$B51,WC_Dates,5,FALSE),IF('Seeding Plan'!$C$8=\"Central\",VLOOKUP('Seeding Plan'!$B51,C_Dates,5,FALSE), IF('Seeding Plan'!$C$8=\"East_Central\",VLOOKUP('Seeding Plan'!$B51,EC_Dates,5,FALSE), IF('Seeding Plan'!$C$8=\"Southwest\",VLOOKUP('Seeding Plan'!$B51,SW_Dates,5,FALSE), IF('Seeding Plan'!$C$8=\"South_Central\",VLOOKUP('Seeding Plan'!$B51,SC_Dates,5,FALSE),IF('Seeding Plan'!$C$8=\"Southeast\",VLOOKUP('Seeding Plan'!$B51,SE_Dates,5,FALSE)))))))))))","v":""},{"$f":"IF('Seeding Plan'!$B51=\"\",\"\",IF('Seeding Plan'!$C$8=\"Northwest\",VLOOKUP('Seeding Plan'!$B51,NW_Dates,6,FALSE),IF('Seeding Plan'!$C$8=\"North_Central\",VLOOKUP('Seeding Plan'!$B51,NC_Dates,6,FALSE),IF('Seeding Plan'!$C$8=\"Northeast\",VLOOKUP('Seeding Plan'!$B51,NE_Dates,6,FALSE),IF('Seeding Plan'!$C$8=\"West_Central\",VLOOKUP('Seeding Plan'!$B51,WC_Dates,6,FALSE),IF('Seeding Plan'!$C$8=\"Central\",VLOOKUP('Seeding Plan'!$B51,C_Dates,6,FALSE), IF('Seeding Plan'!$C$8=\"East_Central\",VLOOKUP('Seeding Plan'!$B51,EC_Dates,6,FALSE), IF('Seeding Plan'!$C$8=\"Southwest\",VLOOKUP('Seeding Plan'!$B51,SW_Dates,6,FALSE), IF('Seeding Plan'!$C$8=\"South_Central\",VLOOKUP('Seeding Plan'!$B51,SC_Dates,6,FALSE),IF('Seeding Plan'!$C$8=\"Southeast\",VLOOKUP('Seeding Plan'!$B51,SE_Dates,6,FALSE)))))))))))","v":""},{"$f":"IF('Seeding Plan'!$B51=\"\",\"\",IF('Seeding Plan'!$C$8=\"Northwest\",VLOOKUP('Seeding Plan'!$B51,NW_Dates,7,FALSE),IF('Seeding Plan'!$C$8=\"North_Central\",VLOOKUP('Seeding Plan'!$B51,NC_Dates,7,FALSE),IF('Seeding Plan'!$C$8=\"Northeast\",VLOOKUP('Seeding Plan'!$B51,NE_Dates,7,FALSE),IF('Seeding Plan'!$C$8=\"West_Central\",VLOOKUP('Seeding Plan'!$B51,WC_Dates,7,FALSE),IF('Seeding Plan'!$C$8=\"Central\",VLOOKUP('Seeding Plan'!$B51,C_Dates,7,FALSE), IF('Seeding Plan'!$C$8=\"East_Central\",VLOOKUP('Seeding Plan'!$B51,EC_Dates,7,FALSE), IF('Seeding Plan'!$C$8=\"Southwest\",VLOOKUP('Seeding Plan'!$B51,SW_Dates,7,FALSE), IF('Seeding Plan'!$C$8=\"South_Central\",VLOOKUP('Seeding Plan'!$B51,SC_Dates,7,FALSE),IF('Seeding Plan'!$C$8=\"Southeast\",VLOOKUP('Seeding Plan'!$B51,SE_Dates,7,FALSE)))))))))))","v":""},{"$f":"IF('Seeding Plan'!$B51=\"\",\"\",IF('Seeding Plan'!$C$8=\"Northwest\",VLOOKUP('Seeding Plan'!$B51,NW_Dates,8,FALSE),IF('Seeding Plan'!$C$8=\"North_Central\",VLOOKUP('Seeding Plan'!$B51,NC_Dates,8,FALSE),IF('Seeding Plan'!$C$8=\"Northeast\",VLOOKUP('Seeding Plan'!$B51,NE_Dates,8,FALSE),IF('Seeding Plan'!$C$8=\"West_Central\",VLOOKUP('Seeding Plan'!$B51,WC_Dates,8,FALSE),IF('Seeding Plan'!$C$8=\"Central\",VLOOKUP('Seeding Plan'!$B51,C_Dates,8,FALSE), IF('Seeding Plan'!$C$8=\"East_Central\",VLOOKUP('Seeding Plan'!$B51,EC_Dates,8,FALSE), IF('Seeding Plan'!$C$8=\"Southwest\",VLOOKUP('Seeding Plan'!$B51,SW_Dates,8,FALSE), IF('Seeding Plan'!$C$8=\"South_Central\",VLOOKUP('Seeding Plan'!$B51,SC_Dates,8,FALSE),IF('Seeding Plan'!$C$8=\"Southeast\",VLOOKUP('Seeding Plan'!$B51,SE_Dates,8,FALSE)))))))))))","v":""},{"$f":"IF('Seeding Plan'!$B51=\"\",\"\",IF('Seeding Plan'!$C$8=\"Northwest\",VLOOKUP('Seeding Plan'!$B51,NW_Dates,9,FALSE),IF('Seeding Plan'!$C$8=\"North_Central\",VLOOKUP('Seeding Plan'!$B51,NC_Dates,9,FALSE),IF('Seeding Plan'!$C$8=\"Northeast\",VLOOKUP('Seeding Plan'!$B51,NE_Dates,9,FALSE),IF('Seeding Plan'!$C$8=\"West_Central\",VLOOKUP('Seeding Plan'!$B51,WC_Dates,9,FALSE),IF('Seeding Plan'!$C$8=\"Central\",VLOOKUP('Seeding Plan'!$B51,C_Dates,9,FALSE), IF('Seeding Plan'!$C$8=\"East_Central\",VLOOKUP('Seeding Plan'!$B51,EC_Dates,9,FALSE), IF('Seeding Plan'!$C$8=\"Southwest\",VLOOKUP('Seeding Plan'!$B51,SW_Dates,9,FALSE), IF('Seeding Plan'!$C$8=\"South_Central\",VLOOKUP('Seeding Plan'!$B51,SC_Dates,9,FALSE),IF('Seeding Plan'!$C$8=\"Southeast\",VLOOKUP('Seeding Plan'!$B51,SE_Dates,9,FALSE)))))))))))","v":""}]
["Mungbeans","-","2021-05-12","2021-08-06","-","-","-","-","-",null,{"$f":"+'Seeding Plan'!B52","v":0},{"$f":"IF('Seeding Plan'!$B52=\"\",\"\",IF('Seeding Plan'!$C$8=\"Northwest\",VLOOKUP('Seeding Plan'!$B52,NW_Dates,2,FALSE),IF('Seeding Plan'!$C$8=\"North_Central\",VLOOKUP('Seeding Plan'!$B52,NC_Dates,2,FALSE),IF('Seeding Plan'!$C$8=\"Northeast\",VLOOKUP('Seeding Plan'!$B52,NE_Dates,2,FALSE),IF('Seeding Plan'!$C$8=\"West_Central\",VLOOKUP('Seeding Plan'!$B52,WC_Dates,2,FALSE),IF('Seeding Plan'!$C$8=\"Central\",VLOOKUP('Seeding Plan'!$B52,C_Dates,2,FALSE), IF('Seeding Plan'!$C$8=\"East_Central\",VLOOKUP('Seeding Plan'!$B52,EC_Dates,2,FALSE), IF('Seeding Plan'!$C$8=\"Southwest\",VLOOKUP('Seeding Plan'!$B52,SW_Dates,2,FALSE), IF('Seeding Plan'!$C$8=\"South_Central\",VLOOKUP('Seeding Plan'!$B52,SC_Dates,2,FALSE),IF('Seeding Plan'!$C$8=\"Southeast\",VLOOKUP('Seeding Plan'!$B52,SE_Dates,2,FALSE)))))))))))","v":""},{"$f":"IF('Seeding Plan'!B52=\"\",\"\",IF('Seeding Plan'!$C$8=\"Northwest\",VLOOKUP('Seeding Plan'!$B52,NW_Dates,3,FALSE),IF('Seeding Plan'!$C$8=\"North_Central\",VLOOKUP('Seeding Plan'!$B52,NC_Dates,3,FALSE),IF('Seeding Plan'!$C$8=\"Northeast\",VLOOKUP('Seeding Plan'!$B52,NE_Dates,3,FALSE),IF('Seeding Plan'!$C$8=\"West_Central\",VLOOKUP('Seeding Plan'!$B52,WC_Dates,3,FALSE),IF('Seeding Plan'!$C$8=\"Central\",VLOOKUP('Seeding Plan'!$B52,C_Dates,3,FALSE), IF('Seeding Plan'!$C$8=\"East_Central\",VLOOKUP('Seeding Plan'!$B52,EC_Dates,3,FALSE), IF('Seeding Plan'!$C$8=\"Southwest\",VLOOKUP('Seeding Plan'!$B52,SW_Dates,3,FALSE), IF('Seeding Plan'!$C$8=\"South_Central\",VLOOKUP('Seeding Plan'!$B52,SC_Dates,3,FALSE),IF('Seeding Plan'!$C$8=\"Southeast\",VLOOKUP('Seeding Plan'!$B52,SE_Dates,3,FALSE)))))))))))","v":""},{"$f":"IF('Seeding Plan'!$B52=\"\",\"\",IF('Seeding Plan'!$C$8=\"Northwest\",VLOOKUP('Seeding Plan'!$B52,NW_Dates,4,FALSE),IF('Seeding Plan'!$C$8=\"North_Central\",VLOOKUP('Seeding Plan'!$B52,NC_Dates,4,FALSE),IF('Seeding Plan'!$C$8=\"Northeast\",VLOOKUP('Seeding Plan'!$B52,NE_Dates,4,FALSE),IF('Seeding Plan'!$C$8=\"West_Central\",VLOOKUP('Seeding Plan'!$B52,WC_Dates,4,FALSE),IF('Seeding Plan'!$C$8=\"Central\",VLOOKUP('Seeding Plan'!$B52,C_Dates,4,FALSE), IF('Seeding Plan'!$C$8=\"East_Central\",VLOOKUP('Seeding Plan'!$B52,EC_Dates,4,FALSE), IF('Seeding Plan'!$C$8=\"Southwest\",VLOOKUP('Seeding Plan'!$B52,SW_Dates,4,FALSE), IF('Seeding Plan'!$C$8=\"South_Central\",VLOOKUP('Seeding Plan'!$B52,SC_Dates,4,FALSE),IF('Seeding Plan'!$C$8=\"Southeast\",VLOOKUP('Seeding Plan'!$B52,SE_Dates,4,FALSE)))))))))))","v":""},{"$f":"IF('Seeding Plan'!$B52=\"\",\"\",IF('Seeding Plan'!$C$8=\"Northwest\",VLOOKUP('Seeding Plan'!$B52,NW_Dates,5,FALSE),IF('Seeding Plan'!$C$8=\"North_Central\",VLOOKUP('Seeding Plan'!$B52,NC_Dates,5,FALSE),IF('Seeding Plan'!$C$8=\"Northeast\",VLOOKUP('Seeding Plan'!$B52,NE_Dates,5,FALSE),IF('Seeding Plan'!$C$8=\"West_Central\",VLOOKUP('Seeding Plan'!$B52,WC_Dates,5,FALSE),IF('Seeding Plan'!$C$8=\"Central\",VLOOKUP('Seeding Plan'!$B52,C_Dates,5,FALSE), IF('Seeding Plan'!$C$8=\"East_Central\",VLOOKUP('Seeding Plan'!$B52,EC_Dates,5,FALSE), IF('Seeding Plan'!$C$8=\"Southwest\",VLOOKUP('Seeding Plan'!$B52,SW_Dates,5,FALSE), IF('Seeding Plan'!$C$8=\"South_Central\",VLOOKUP('Seeding Plan'!$B52,SC_Dates,5,FALSE),IF('Seeding Plan'!$C$8=\"Southeast\",VLOOKUP('Seeding Plan'!$B52,SE_Dates,5,FALSE)))))))))))","v":""},{"$f":"IF('Seeding Plan'!$B52=\"\",\"\",IF('Seeding Plan'!$C$8=\"Northwest\",VLOOKUP('Seeding Plan'!$B52,NW_Dates,6,FALSE),IF('Seeding Plan'!$C$8=\"North_Central\",VLOOKUP('Seeding Plan'!$B52,NC_Dates,6,FALSE),IF('Seeding Plan'!$C$8=\"Northeast\",VLOOKUP('Seeding Plan'!$B52,NE_Dates,6,FALSE),IF('Seeding Plan'!$C$8=\"West_Central\",VLOOKUP('Seeding Plan'!$B52,WC_Dates,6,FALSE),IF('Seeding Plan'!$C$8=\"Central\",VLOOKUP('Seeding Plan'!$B52,C_Dates,6,FALSE), IF('Seeding Plan'!$C$8=\"East_Central\",VLOOKUP('Seeding Plan'!$B52,EC_Dates,6,FALSE), IF('Seeding Plan'!$C$8=\"Southwest\",VLOOKUP('Seeding Plan'!$B52,SW_Dates,6,FALSE), IF('Seeding Plan'!$C$8=\"South_Central\",VLOOKUP('Seeding Plan'!$B52,SC_Dates,6,FALSE),IF('Seeding Plan'!$C$8=\"Southeast\",VLOOKUP('Seeding Plan'!$B52,SE_Dates,6,FALSE)))))))))))","v":""},{"$f":"IF('Seeding Plan'!$B52=\"\",\"\",IF('Seeding Plan'!$C$8=\"Northwest\",VLOOKUP('Seeding Plan'!$B52,NW_Dates,7,FALSE),IF('Seeding Plan'!$C$8=\"North_Central\",VLOOKUP('Seeding Plan'!$B52,NC_Dates,7,FALSE),IF('Seeding Plan'!$C$8=\"Northeast\",VLOOKUP('Seeding Plan'!$B52,NE_Dates,7,FALSE),IF('Seeding Plan'!$C$8=\"West_Central\",VLOOKUP('Seeding Plan'!$B52,WC_Dates,7,FALSE),IF('Seeding Plan'!$C$8=\"Central\",VLOOKUP('Seeding Plan'!$B52,C_Dates,7,FALSE), IF('Seeding Plan'!$C$8=\"East_Central\",VLOOKUP('Seeding Plan'!$B52,EC_Dates,7,FALSE), IF('Seeding Plan'!$C$8=\"Southwest\",VLOOKUP('Seeding Plan'!$B52,SW_Dates,7,FALSE), IF('Seeding Plan'!$C$8=\"South_Central\",VLOOKUP('Seeding Plan'!$B52,SC_Dates,7,FALSE),IF('Seeding Plan'!$C$8=\"Southeast\",VLOOKUP('Seeding Plan'!$B52,SE_Dates,7,FALSE)))))))))))","v":""},{"$f":"IF('Seeding Plan'!$B52=\"\",\"\",IF('Seeding Plan'!$C$8=\"Northwest\",VLOOKUP('Seeding Plan'!$B52,NW_Dates,8,FALSE),IF('Seeding Plan'!$C$8=\"North_Central\",VLOOKUP('Seeding Plan'!$B52,NC_Dates,8,FALSE),IF('Seeding Plan'!$C$8=\"Northeast\",VLOOKUP('Seeding Plan'!$B52,NE_Dates,8,FALSE),IF('Seeding Plan'!$C$8=\"West_Central\",VLOOKUP('Seeding Plan'!$B52,WC_Dates,8,FALSE),IF('Seeding Plan'!$C$8=\"Central\",VLOOKUP('Seeding Plan'!$B52,C_Dates,8,FALSE), IF('Seeding Plan'!$C$8=\"East_Central\",VLOOKUP('Seeding Plan'!$B52,EC_Dates,8,FALSE), IF('Seeding Plan'!$C$8=\"Southwest\",VLOOKUP('Seeding Plan'!$B52,SW_Dates,8,FALSE), IF('Seeding Plan'!$C$8=\"South_Central\",VLOOKUP('Seeding Plan'!$B52,SC_Dates,8,FALSE),IF('Seeding Plan'!$C$8=\"Southeast\",VLOOKUP('Seeding Plan'!$B52,SE_Dates,8,FALSE)))))))))))","v":""},{"$f":"IF('Seeding Plan'!$B52=\"\",\"\",IF('Seeding Plan'!$C$8=\"Northwest\",VLOOKUP('Seeding Plan'!$B52,NW_Dates,9,FALSE),IF('Seeding Plan'!$C$8=\"North_Central\",VLOOKUP('Seeding Plan'!$B52,NC_Dates,9,FALSE),IF('Seeding Plan'!$C$8=\"Northeast\",VLOOKUP('Seeding Plan'!$B52,NE_Dates,9,FALSE),IF('Seeding Plan'!$C$8=\"West_Central\",VLOOKUP('Seeding Plan'!$B52,WC_Dates,9,FALSE),IF('Seeding Plan'!$C$8=\"Central\",VLOOKUP('Seeding Plan'!$B52,C_Dates,9,FALSE), IF('Seeding Plan'!$C$8=\"East_Central\",VLOOKUP('Seeding Plan'!$B52,EC_Dates,9,FALSE), IF('Seeding Plan'!$C$8=\"Southwest\",VLOOKUP('Seeding Plan'!$B52,SW_Dates,9,FALSE), IF('Seeding Plan'!$C$8=\"South_Central\",VLOOKUP('Seeding Plan'!$B52,SC_Dates,9,FALSE),IF('Seeding Plan'!$C$8=\"Southeast\",VLOOKUP('Seeding Plan'!$B52,SE_Dates,9,FALSE)))))))))))","v":""}]
["Buckwheat","-","2021-05-12","2021-09-09","--","--","2021-05-12","2021-09-09","-",null,{"$f":"+'Seeding Plan'!B53","v":0},{"$f":"IF('Seeding Plan'!$B53=\"\",\"\",IF('Seeding Plan'!$C$8=\"Northwest\",VLOOKUP('Seeding Plan'!$B53,NW_Dates,2,FALSE),IF('Seeding Plan'!$C$8=\"North_Central\",VLOOKUP('Seeding Plan'!$B53,NC_Dates,2,FALSE),IF('Seeding Plan'!$C$8=\"Northeast\",VLOOKUP('Seeding Plan'!$B53,NE_Dates,2,FALSE),IF('Seeding Plan'!$C$8=\"West_Central\",VLOOKUP('Seeding Plan'!$B53,WC_Dates,2,FALSE),IF('Seeding Plan'!$C$8=\"Central\",VLOOKUP('Seeding Plan'!$B53,C_Dates,2,FALSE), IF('Seeding Plan'!$C$8=\"East_Central\",VLOOKUP('Seeding Plan'!$B53,EC_Dates,2,FALSE), IF('Seeding Plan'!$C$8=\"Southwest\",VLOOKUP('Seeding Plan'!$B53,SW_Dates,2,FALSE), IF('Seeding Plan'!$C$8=\"South_Central\",VLOOKUP('Seeding Plan'!$B53,SC_Dates,2,FALSE),IF('Seeding Plan'!$C$8=\"Southeast\",VLOOKUP('Seeding Plan'!$B53,SE_Dates,2,FALSE)))))))))))","v":""},{"$f":"IF('Seeding Plan'!B53=\"\",\"\",IF('Seeding Plan'!$C$8=\"Northwest\",VLOOKUP('Seeding Plan'!$B53,NW_Dates,3,FALSE),IF('Seeding Plan'!$C$8=\"North_Central\",VLOOKUP('Seeding Plan'!$B53,NC_Dates,3,FALSE),IF('Seeding Plan'!$C$8=\"Northeast\",VLOOKUP('Seeding Plan'!$B53,NE_Dates,3,FALSE),IF('Seeding Plan'!$C$8=\"West_Central\",VLOOKUP('Seeding Plan'!$B53,WC_Dates,3,FALSE),IF('Seeding Plan'!$C$8=\"Central\",VLOOKUP('Seeding Plan'!$B53,C_Dates,3,FALSE), IF('Seeding Plan'!$C$8=\"East_Central\",VLOOKUP('Seeding Plan'!$B53,EC_Dates,3,FALSE), IF('Seeding Plan'!$C$8=\"Southwest\",VLOOKUP('Seeding Plan'!$B53,SW_Dates,3,FALSE), IF('Seeding Plan'!$C$8=\"South_Central\",VLOOKUP('Seeding Plan'!$B53,SC_Dates,3,FALSE),IF('Seeding Plan'!$C$8=\"Southeast\",VLOOKUP('Seeding Plan'!$B53,SE_Dates,3,FALSE)))))))))))","v":""},{"$f":"IF('Seeding Plan'!$B53=\"\",\"\",IF('Seeding Plan'!$C$8=\"Northwest\",VLOOKUP('Seeding Plan'!$B53,NW_Dates,4,FALSE),IF('Seeding Plan'!$C$8=\"North_Central\",VLOOKUP('Seeding Plan'!$B53,NC_Dates,4,FALSE),IF('Seeding Plan'!$C$8=\"Northeast\",VLOOKUP('Seeding Plan'!$B53,NE_Dates,4,FALSE),IF('Seeding Plan'!$C$8=\"West_Central\",VLOOKUP('Seeding Plan'!$B53,WC_Dates,4,FALSE),IF('Seeding Plan'!$C$8=\"Central\",VLOOKUP('Seeding Plan'!$B53,C_Dates,4,FALSE), IF('Seeding Plan'!$C$8=\"East_Central\",VLOOKUP('Seeding Plan'!$B53,EC_Dates,4,FALSE), IF('Seeding Plan'!$C$8=\"Southwest\",VLOOKUP('Seeding Plan'!$B53,SW_Dates,4,FALSE), IF('Seeding Plan'!$C$8=\"South_Central\",VLOOKUP('Seeding Plan'!$B53,SC_Dates,4,FALSE),IF('Seeding Plan'!$C$8=\"Southeast\",VLOOKUP('Seeding Plan'!$B53,SE_Dates,4,FALSE)))))))))))","v":""},{"$f":"IF('Seeding Plan'!$B53=\"\",\"\",IF('Seeding Plan'!$C$8=\"Northwest\",VLOOKUP('Seeding Plan'!$B53,NW_Dates,5,FALSE),IF('Seeding Plan'!$C$8=\"North_Central\",VLOOKUP('Seeding Plan'!$B53,NC_Dates,5,FALSE),IF('Seeding Plan'!$C$8=\"Northeast\",VLOOKUP('Seeding Plan'!$B53,NE_Dates,5,FALSE),IF('Seeding Plan'!$C$8=\"West_Central\",VLOOKUP('Seeding Plan'!$B53,WC_Dates,5,FALSE),IF('Seeding Plan'!$C$8=\"Central\",VLOOKUP('Seeding Plan'!$B53,C_Dates,5,FALSE), IF('Seeding Plan'!$C$8=\"East_Central\",VLOOKUP('Seeding Plan'!$B53,EC_Dates,5,FALSE), IF('Seeding Plan'!$C$8=\"Southwest\",VLOOKUP('Seeding Plan'!$B53,SW_Dates,5,FALSE), IF('Seeding Plan'!$C$8=\"South_Central\",VLOOKUP('Seeding Plan'!$B53,SC_Dates,5,FALSE),IF('Seeding Plan'!$C$8=\"Southeast\",VLOOKUP('Seeding Plan'!$B53,SE_Dates,5,FALSE)))))))))))","v":""},{"$f":"IF('Seeding Plan'!$B53=\"\",\"\",IF('Seeding Plan'!$C$8=\"Northwest\",VLOOKUP('Seeding Plan'!$B53,NW_Dates,6,FALSE),IF('Seeding Plan'!$C$8=\"North_Central\",VLOOKUP('Seeding Plan'!$B53,NC_Dates,6,FALSE),IF('Seeding Plan'!$C$8=\"Northeast\",VLOOKUP('Seeding Plan'!$B53,NE_Dates,6,FALSE),IF('Seeding Plan'!$C$8=\"West_Central\",VLOOKUP('Seeding Plan'!$B53,WC_Dates,6,FALSE),IF('Seeding Plan'!$C$8=\"Central\",VLOOKUP('Seeding Plan'!$B53,C_Dates,6,FALSE), IF('Seeding Plan'!$C$8=\"East_Central\",VLOOKUP('Seeding Plan'!$B53,EC_Dates,6,FALSE), IF('Seeding Plan'!$C$8=\"Southwest\",VLOOKUP('Seeding Plan'!$B53,SW_Dates,6,FALSE), IF('Seeding Plan'!$C$8=\"South_Central\",VLOOKUP('Seeding Plan'!$B53,SC_Dates,6,FALSE),IF('Seeding Plan'!$C$8=\"Southeast\",VLOOKUP('Seeding Plan'!$B53,SE_Dates,6,FALSE)))))))))))","v":""},{"$f":"IF('Seeding Plan'!$B53=\"\",\"\",IF('Seeding Plan'!$C$8=\"Northwest\",VLOOKUP('Seeding Plan'!$B53,NW_Dates,7,FALSE),IF('Seeding Plan'!$C$8=\"North_Central\",VLOOKUP('Seeding Plan'!$B53,NC_Dates,7,FALSE),IF('Seeding Plan'!$C$8=\"Northeast\",VLOOKUP('Seeding Plan'!$B53,NE_Dates,7,FALSE),IF('Seeding Plan'!$C$8=\"West_Central\",VLOOKUP('Seeding Plan'!$B53,WC_Dates,7,FALSE),IF('Seeding Plan'!$C$8=\"Central\",VLOOKUP('Seeding Plan'!$B53,C_Dates,7,FALSE), IF('Seeding Plan'!$C$8=\"East_Central\",VLOOKUP('Seeding Plan'!$B53,EC_Dates,7,FALSE), IF('Seeding Plan'!$C$8=\"Southwest\",VLOOKUP('Seeding Plan'!$B53,SW_Dates,7,FALSE), IF('Seeding Plan'!$C$8=\"South_Central\",VLOOKUP('Seeding Plan'!$B53,SC_Dates,7,FALSE),IF('Seeding Plan'!$C$8=\"Southeast\",VLOOKUP('Seeding Plan'!$B53,SE_Dates,7,FALSE)))))))))))","v":""},{"$f":"IF('Seeding Plan'!$B53=\"\",\"\",IF('Seeding Plan'!$C$8=\"Northwest\",VLOOKUP('Seeding Plan'!$B53,NW_Dates,8,FALSE),IF('Seeding Plan'!$C$8=\"North_Central\",VLOOKUP('Seeding Plan'!$B53,NC_Dates,8,FALSE),IF('Seeding Plan'!$C$8=\"Northeast\",VLOOKUP('Seeding Plan'!$B53,NE_Dates,8,FALSE),IF('Seeding Plan'!$C$8=\"West_Central\",VLOOKUP('Seeding Plan'!$B53,WC_Dates,8,FALSE),IF('Seeding Plan'!$C$8=\"Central\",VLOOKUP('Seeding Plan'!$B53,C_Dates,8,FALSE), IF('Seeding Plan'!$C$8=\"East_Central\",VLOOKUP('Seeding Plan'!$B53,EC_Dates,8,FALSE), IF('Seeding Plan'!$C$8=\"Southwest\",VLOOKUP('Seeding Plan'!$B53,SW_Dates,8,FALSE), IF('Seeding Plan'!$C$8=\"South_Central\",VLOOKUP('Seeding Plan'!$B53,SC_Dates,8,FALSE),IF('Seeding Plan'!$C$8=\"Southeast\",VLOOKUP('Seeding Plan'!$B53,SE_Dates,8,FALSE)))))))))))","v":""},{"$f":"IF('Seeding Plan'!$B53=\"\",\"\",IF('Seeding Plan'!$C$8=\"Northwest\",VLOOKUP('Seeding Plan'!$B53,NW_Dates,9,FALSE),IF('Seeding Plan'!$C$8=\"North_Central\",VLOOKUP('Seeding Plan'!$B53,NC_Dates,9,FALSE),IF('Seeding Plan'!$C$8=\"Northeast\",VLOOKUP('Seeding Plan'!$B53,NE_Dates,9,FALSE),IF('Seeding Plan'!$C$8=\"West_Central\",VLOOKUP('Seeding Plan'!$B53,WC_Dates,9,FALSE),IF('Seeding Plan'!$C$8=\"Central\",VLOOKUP('Seeding Plan'!$B53,C_Dates,9,FALSE), IF('Seeding Plan'!$C$8=\"East_Central\",VLOOKUP('Seeding Plan'!$B53,EC_Dates,9,FALSE), IF('Seeding Plan'!$C$8=\"Southwest\",VLOOKUP('Seeding Plan'!$B53,SW_Dates,9,FALSE), IF('Seeding Plan'!$C$8=\"South_Central\",VLOOKUP('Seeding Plan'!$B53,SC_Dates,9,FALSE),IF('Seeding Plan'!$C$8=\"Southeast\",VLOOKUP('Seeding Plan'!$B53,SE_Dates,9,FALSE)))))))))))","v":""}]
["Camelina, Winter","-","-","-","-","2021-08-06","2021-08-20","2021-10-22","2021-11-03",null,{"$f":"+'Seeding Plan'!B54","v":0},{"$f":"IF('Seeding Plan'!$B54=\"\",\"\",IF('Seeding Plan'!$C$8=\"Northwest\",VLOOKUP('Seeding Plan'!$B54,NW_Dates,2,FALSE),IF('Seeding Plan'!$C$8=\"North_Central\",VLOOKUP('Seeding Plan'!$B54,NC_Dates,2,FALSE),IF('Seeding Plan'!$C$8=\"Northeast\",VLOOKUP('Seeding Plan'!$B54,NE_Dates,2,FALSE),IF('Seeding Plan'!$C$8=\"West_Central\",VLOOKUP('Seeding Plan'!$B54,WC_Dates,2,FALSE),IF('Seeding Plan'!$C$8=\"Central\",VLOOKUP('Seeding Plan'!$B54,C_Dates,2,FALSE), IF('Seeding Plan'!$C$8=\"East_Central\",VLOOKUP('Seeding Plan'!$B54,EC_Dates,2,FALSE), IF('Seeding Plan'!$C$8=\"Southwest\",VLOOKUP('Seeding Plan'!$B54,SW_Dates,2,FALSE), IF('Seeding Plan'!$C$8=\"South_Central\",VLOOKUP('Seeding Plan'!$B54,SC_Dates,2,FALSE),IF('Seeding Plan'!$C$8=\"Southeast\",VLOOKUP('Seeding Plan'!$B54,SE_Dates,2,FALSE)))))))))))","v":""},{"$f":"IF('Seeding Plan'!B54=\"\",\"\",IF('Seeding Plan'!$C$8=\"Northwest\",VLOOKUP('Seeding Plan'!$B54,NW_Dates,3,FALSE),IF('Seeding Plan'!$C$8=\"North_Central\",VLOOKUP('Seeding Plan'!$B54,NC_Dates,3,FALSE),IF('Seeding Plan'!$C$8=\"Northeast\",VLOOKUP('Seeding Plan'!$B54,NE_Dates,3,FALSE),IF('Seeding Plan'!$C$8=\"West_Central\",VLOOKUP('Seeding Plan'!$B54,WC_Dates,3,FALSE),IF('Seeding Plan'!$C$8=\"Central\",VLOOKUP('Seeding Plan'!$B54,C_Dates,3,FALSE), IF('Seeding Plan'!$C$8=\"East_Central\",VLOOKUP('Seeding Plan'!$B54,EC_Dates,3,FALSE), IF('Seeding Plan'!$C$8=\"Southwest\",VLOOKUP('Seeding Plan'!$B54,SW_Dates,3,FALSE), IF('Seeding Plan'!$C$8=\"South_Central\",VLOOKUP('Seeding Plan'!$B54,SC_Dates,3,FALSE),IF('Seeding Plan'!$C$8=\"Southeast\",VLOOKUP('Seeding Plan'!$B54,SE_Dates,3,FALSE)))))))))))","v":""},{"$f":"IF('Seeding Plan'!$B54=\"\",\"\",IF('Seeding Plan'!$C$8=\"Northwest\",VLOOKUP('Seeding Plan'!$B54,NW_Dates,4,FALSE),IF('Seeding Plan'!$C$8=\"North_Central\",VLOOKUP('Seeding Plan'!$B54,NC_Dates,4,FALSE),IF('Seeding Plan'!$C$8=\"Northeast\",VLOOKUP('Seeding Plan'!$B54,NE_Dates,4,FALSE),IF('Seeding Plan'!$C$8=\"West_Central\",VLOOKUP('Seeding Plan'!$B54,WC_Dates,4,FALSE),IF('Seeding Plan'!$C$8=\"Central\",VLOOKUP('Seeding Plan'!$B54,C_Dates,4,FALSE), IF('Seeding Plan'!$C$8=\"East_Central\",VLOOKUP('Seeding Plan'!$B54,EC_Dates,4,FALSE), IF('Seeding Plan'!$C$8=\"Southwest\",VLOOKUP('Seeding Plan'!$B54,SW_Dates,4,FALSE), IF('Seeding Plan'!$C$8=\"South_Central\",VLOOKUP('Seeding Plan'!$B54,SC_Dates,4,FALSE),IF('Seeding Plan'!$C$8=\"Southeast\",VLOOKUP('Seeding Plan'!$B54,SE_Dates,4,FALSE)))))))))))","v":""},{"$f":"IF('Seeding Plan'!$B54=\"\",\"\",IF('Seeding Plan'!$C$8=\"Northwest\",VLOOKUP('Seeding Plan'!$B54,NW_Dates,5,FALSE),IF('Seeding Plan'!$C$8=\"North_Central\",VLOOKUP('Seeding Plan'!$B54,NC_Dates,5,FALSE),IF('Seeding Plan'!$C$8=\"Northeast\",VLOOKUP('Seeding Plan'!$B54,NE_Dates,5,FALSE),IF('Seeding Plan'!$C$8=\"West_Central\",VLOOKUP('Seeding Plan'!$B54,WC_Dates,5,FALSE),IF('Seeding Plan'!$C$8=\"Central\",VLOOKUP('Seeding Plan'!$B54,C_Dates,5,FALSE), IF('Seeding Plan'!$C$8=\"East_Central\",VLOOKUP('Seeding Plan'!$B54,EC_Dates,5,FALSE), IF('Seeding Plan'!$C$8=\"Southwest\",VLOOKUP('Seeding Plan'!$B54,SW_Dates,5,FALSE), IF('Seeding Plan'!$C$8=\"South_Central\",VLOOKUP('Seeding Plan'!$B54,SC_Dates,5,FALSE),IF('Seeding Plan'!$C$8=\"Southeast\",VLOOKUP('Seeding Plan'!$B54,SE_Dates,5,FALSE)))))))))))","v":""},{"$f":"IF('Seeding Plan'!$B54=\"\",\"\",IF('Seeding Plan'!$C$8=\"Northwest\",VLOOKUP('Seeding Plan'!$B54,NW_Dates,6,FALSE),IF('Seeding Plan'!$C$8=\"North_Central\",VLOOKUP('Seeding Plan'!$B54,NC_Dates,6,FALSE),IF('Seeding Plan'!$C$8=\"Northeast\",VLOOKUP('Seeding Plan'!$B54,NE_Dates,6,FALSE),IF('Seeding Plan'!$C$8=\"West_Central\",VLOOKUP('Seeding Plan'!$B54,WC_Dates,6,FALSE),IF('Seeding Plan'!$C$8=\"Central\",VLOOKUP('Seeding Plan'!$B54,C_Dates,6,FALSE), IF('Seeding Plan'!$C$8=\"East_Central\",VLOOKUP('Seeding Plan'!$B54,EC_Dates,6,FALSE), IF('Seeding Plan'!$C$8=\"Southwest\",VLOOKUP('Seeding Plan'!$B54,SW_Dates,6,FALSE), IF('Seeding Plan'!$C$8=\"South_Central\",VLOOKUP('Seeding Plan'!$B54,SC_Dates,6,FALSE),IF('Seeding Plan'!$C$8=\"Southeast\",VLOOKUP('Seeding Plan'!$B54,SE_Dates,6,FALSE)))))))))))","v":""},{"$f":"IF('Seeding Plan'!$B54=\"\",\"\",IF('Seeding Plan'!$C$8=\"Northwest\",VLOOKUP('Seeding Plan'!$B54,NW_Dates,7,FALSE),IF('Seeding Plan'!$C$8=\"North_Central\",VLOOKUP('Seeding Plan'!$B54,NC_Dates,7,FALSE),IF('Seeding Plan'!$C$8=\"Northeast\",VLOOKUP('Seeding Plan'!$B54,NE_Dates,7,FALSE),IF('Seeding Plan'!$C$8=\"West_Central\",VLOOKUP('Seeding Plan'!$B54,WC_Dates,7,FALSE),IF('Seeding Plan'!$C$8=\"Central\",VLOOKUP('Seeding Plan'!$B54,C_Dates,7,FALSE), IF('Seeding Plan'!$C$8=\"East_Central\",VLOOKUP('Seeding Plan'!$B54,EC_Dates,7,FALSE), IF('Seeding Plan'!$C$8=\"Southwest\",VLOOKUP('Seeding Plan'!$B54,SW_Dates,7,FALSE), IF('Seeding Plan'!$C$8=\"South_Central\",VLOOKUP('Seeding Plan'!$B54,SC_Dates,7,FALSE),IF('Seeding Plan'!$C$8=\"Southeast\",VLOOKUP('Seeding Plan'!$B54,SE_Dates,7,FALSE)))))))))))","v":""},{"$f":"IF('Seeding Plan'!$B54=\"\",\"\",IF('Seeding Plan'!$C$8=\"Northwest\",VLOOKUP('Seeding Plan'!$B54,NW_Dates,8,FALSE),IF('Seeding Plan'!$C$8=\"North_Central\",VLOOKUP('Seeding Plan'!$B54,NC_Dates,8,FALSE),IF('Seeding Plan'!$C$8=\"Northeast\",VLOOKUP('Seeding Plan'!$B54,NE_Dates,8,FALSE),IF('Seeding Plan'!$C$8=\"West_Central\",VLOOKUP('Seeding Plan'!$B54,WC_Dates,8,FALSE),IF('Seeding Plan'!$C$8=\"Central\",VLOOKUP('Seeding Plan'!$B54,C_Dates,8,FALSE), IF('Seeding Plan'!$C$8=\"East_Central\",VLOOKUP('Seeding Plan'!$B54,EC_Dates,8,FALSE), IF('Seeding Plan'!$C$8=\"Southwest\",VLOOKUP('Seeding Plan'!$B54,SW_Dates,8,FALSE), IF('Seeding Plan'!$C$8=\"South_Central\",VLOOKUP('Seeding Plan'!$B54,SC_Dates,8,FALSE),IF('Seeding Plan'!$C$8=\"Southeast\",VLOOKUP('Seeding Plan'!$B54,SE_Dates,8,FALSE)))))))))))","v":""},{"$f":"IF('Seeding Plan'!$B54=\"\",\"\",IF('Seeding Plan'!$C$8=\"Northwest\",VLOOKUP('Seeding Plan'!$B54,NW_Dates,9,FALSE),IF('Seeding Plan'!$C$8=\"North_Central\",VLOOKUP('Seeding Plan'!$B54,NC_Dates,9,FALSE),IF('Seeding Plan'!$C$8=\"Northeast\",VLOOKUP('Seeding Plan'!$B54,NE_Dates,9,FALSE),IF('Seeding Plan'!$C$8=\"West_Central\",VLOOKUP('Seeding Plan'!$B54,WC_Dates,9,FALSE),IF('Seeding Plan'!$C$8=\"Central\",VLOOKUP('Seeding Plan'!$B54,C_Dates,9,FALSE), IF('Seeding Plan'!$C$8=\"East_Central\",VLOOKUP('Seeding Plan'!$B54,EC_Dates,9,FALSE), IF('Seeding Plan'!$C$8=\"Southwest\",VLOOKUP('Seeding Plan'!$B54,SW_Dates,9,FALSE), IF('Seeding Plan'!$C$8=\"South_Central\",VLOOKUP('Seeding Plan'!$B54,SC_Dates,9,FALSE),IF('Seeding Plan'!$C$8=\"Southeast\",VLOOKUP('Seeding Plan'!$B54,SE_Dates,9,FALSE)))))))))))","v":""}]
["Clover, Berseem","2021-04-01","2021-04-14","2021-05-18","-","-","2021-08-06","2021-08-26","2021-09-09",null,{"$f":"+'Seeding Plan'!B55","v":0},{"$f":"IF('Seeding Plan'!$B55=\"\",\"\",IF('Seeding Plan'!$C$8=\"Northwest\",VLOOKUP('Seeding Plan'!$B55,NW_Dates,2,FALSE),IF('Seeding Plan'!$C$8=\"North_Central\",VLOOKUP('Seeding Plan'!$B55,NC_Dates,2,FALSE),IF('Seeding Plan'!$C$8=\"Northeast\",VLOOKUP('Seeding Plan'!$B55,NE_Dates,2,FALSE),IF('Seeding Plan'!$C$8=\"West_Central\",VLOOKUP('Seeding Plan'!$B55,WC_Dates,2,FALSE),IF('Seeding Plan'!$C$8=\"Central\",VLOOKUP('Seeding Plan'!$B55,C_Dates,2,FALSE), IF('Seeding Plan'!$C$8=\"East_Central\",VLOOKUP('Seeding Plan'!$B55,EC_Dates,2,FALSE), IF('Seeding Plan'!$C$8=\"Southwest\",VLOOKUP('Seeding Plan'!$B55,SW_Dates,2,FALSE), IF('Seeding Plan'!$C$8=\"South_Central\",VLOOKUP('Seeding Plan'!$B55,SC_Dates,2,FALSE),IF('Seeding Plan'!$C$8=\"Southeast\",VLOOKUP('Seeding Plan'!$B55,SE_Dates,2,FALSE)))))))))))","v":""},{"$f":"IF('Seeding Plan'!B55=\"\",\"\",IF('Seeding Plan'!$C$8=\"Northwest\",VLOOKUP('Seeding Plan'!$B55,NW_Dates,3,FALSE),IF('Seeding Plan'!$C$8=\"North_Central\",VLOOKUP('Seeding Plan'!$B55,NC_Dates,3,FALSE),IF('Seeding Plan'!$C$8=\"Northeast\",VLOOKUP('Seeding Plan'!$B55,NE_Dates,3,FALSE),IF('Seeding Plan'!$C$8=\"West_Central\",VLOOKUP('Seeding Plan'!$B55,WC_Dates,3,FALSE),IF('Seeding Plan'!$C$8=\"Central\",VLOOKUP('Seeding Plan'!$B55,C_Dates,3,FALSE), IF('Seeding Plan'!$C$8=\"East_Central\",VLOOKUP('Seeding Plan'!$B55,EC_Dates,3,FALSE), IF('Seeding Plan'!$C$8=\"Southwest\",VLOOKUP('Seeding Plan'!$B55,SW_Dates,3,FALSE), IF('Seeding Plan'!$C$8=\"South_Central\",VLOOKUP('Seeding Plan'!$B55,SC_Dates,3,FALSE),IF('Seeding Plan'!$C$8=\"Southeast\",VLOOKUP('Seeding Plan'!$B55,SE_Dates,3,FALSE)))))))))))","v":""},{"$f":"IF('Seeding Plan'!$B55=\"\",\"\",IF('Seeding Plan'!$C$8=\"Northwest\",VLOOKUP('Seeding Plan'!$B55,NW_Dates,4,FALSE),IF('Seeding Plan'!$C$8=\"North_Central\",VLOOKUP('Seeding Plan'!$B55,NC_Dates,4,FALSE),IF('Seeding Plan'!$C$8=\"Northeast\",VLOOKUP('Seeding Plan'!$B55,NE_Dates,4,FALSE),IF('Seeding Plan'!$C$8=\"West_Central\",VLOOKUP('Seeding Plan'!$B55,WC_Dates,4,FALSE),IF('Seeding Plan'!$C$8=\"Central\",VLOOKUP('Seeding Plan'!$B55,C_Dates,4,FALSE), IF('Seeding Plan'!$C$8=\"East_Central\",VLOOKUP('Seeding Plan'!$B55,EC_Dates,4,FALSE), IF('Seeding Plan'!$C$8=\"Southwest\",VLOOKUP('Seeding Plan'!$B55,SW_Dates,4,FALSE), IF('Seeding Plan'!$C$8=\"South_Central\",VLOOKUP('Seeding Plan'!$B55,SC_Dates,4,FALSE),IF('Seeding Plan'!$C$8=\"Southeast\",VLOOKUP('Seeding Plan'!$B55,SE_Dates,4,FALSE)))))))))))","v":""},{"$f":"IF('Seeding Plan'!$B55=\"\",\"\",IF('Seeding Plan'!$C$8=\"Northwest\",VLOOKUP('Seeding Plan'!$B55,NW_Dates,5,FALSE),IF('Seeding Plan'!$C$8=\"North_Central\",VLOOKUP('Seeding Plan'!$B55,NC_Dates,5,FALSE),IF('Seeding Plan'!$C$8=\"Northeast\",VLOOKUP('Seeding Plan'!$B55,NE_Dates,5,FALSE),IF('Seeding Plan'!$C$8=\"West_Central\",VLOOKUP('Seeding Plan'!$B55,WC_Dates,5,FALSE),IF('Seeding Plan'!$C$8=\"Central\",VLOOKUP('Seeding Plan'!$B55,C_Dates,5,FALSE), IF('Seeding Plan'!$C$8=\"East_Central\",VLOOKUP('Seeding Plan'!$B55,EC_Dates,5,FALSE), IF('Seeding Plan'!$C$8=\"Southwest\",VLOOKUP('Seeding Plan'!$B55,SW_Dates,5,FALSE), IF('Seeding Plan'!$C$8=\"South_Central\",VLOOKUP('Seeding Plan'!$B55,SC_Dates,5,FALSE),IF('Seeding Plan'!$C$8=\"Southeast\",VLOOKUP('Seeding Plan'!$B55,SE_Dates,5,FALSE)))))))))))","v":""},{"$f":"IF('Seeding Plan'!$B55=\"\",\"\",IF('Seeding Plan'!$C$8=\"Northwest\",VLOOKUP('Seeding Plan'!$B55,NW_Dates,6,FALSE),IF('Seeding Plan'!$C$8=\"North_Central\",VLOOKUP('Seeding Plan'!$B55,NC_Dates,6,FALSE),IF('Seeding Plan'!$C$8=\"Northeast\",VLOOKUP('Seeding Plan'!$B55,NE_Dates,6,FALSE),IF('Seeding Plan'!$C$8=\"West_Central\",VLOOKUP('Seeding Plan'!$B55,WC_Dates,6,FALSE),IF('Seeding Plan'!$C$8=\"Central\",VLOOKUP('Seeding Plan'!$B55,C_Dates,6,FALSE), IF('Seeding Plan'!$C$8=\"East_Central\",VLOOKUP('Seeding Plan'!$B55,EC_Dates,6,FALSE), IF('Seeding Plan'!$C$8=\"Southwest\",VLOOKUP('Seeding Plan'!$B55,SW_Dates,6,FALSE), IF('Seeding Plan'!$C$8=\"South_Central\",VLOOKUP('Seeding Plan'!$B55,SC_Dates,6,FALSE),IF('Seeding Plan'!$C$8=\"Southeast\",VLOOKUP('Seeding Plan'!$B55,SE_Dates,6,FALSE)))))))))))","v":""},{"$f":"IF('Seeding Plan'!$B55=\"\",\"\",IF('Seeding Plan'!$C$8=\"Northwest\",VLOOKUP('Seeding Plan'!$B55,NW_Dates,7,FALSE),IF('Seeding Plan'!$C$8=\"North_Central\",VLOOKUP('Seeding Plan'!$B55,NC_Dates,7,FALSE),IF('Seeding Plan'!$C$8=\"Northeast\",VLOOKUP('Seeding Plan'!$B55,NE_Dates,7,FALSE),IF('Seeding Plan'!$C$8=\"West_Central\",VLOOKUP('Seeding Plan'!$B55,WC_Dates,7,FALSE),IF('Seeding Plan'!$C$8=\"Central\",VLOOKUP('Seeding Plan'!$B55,C_Dates,7,FALSE), IF('Seeding Plan'!$C$8=\"East_Central\",VLOOKUP('Seeding Plan'!$B55,EC_Dates,7,FALSE), IF('Seeding Plan'!$C$8=\"Southwest\",VLOOKUP('Seeding Plan'!$B55,SW_Dates,7,FALSE), IF('Seeding Plan'!$C$8=\"South_Central\",VLOOKUP('Seeding Plan'!$B55,SC_Dates,7,FALSE),IF('Seeding Plan'!$C$8=\"Southeast\",VLOOKUP('Seeding Plan'!$B55,SE_Dates,7,FALSE)))))))))))","v":""},{"$f":"IF('Seeding Plan'!$B55=\"\",\"\",IF('Seeding Plan'!$C$8=\"Northwest\",VLOOKUP('Seeding Plan'!$B55,NW_Dates,8,FALSE),IF('Seeding Plan'!$C$8=\"North_Central\",VLOOKUP('Seeding Plan'!$B55,NC_Dates,8,FALSE),IF('Seeding Plan'!$C$8=\"Northeast\",VLOOKUP('Seeding Plan'!$B55,NE_Dates,8,FALSE),IF('Seeding Plan'!$C$8=\"West_Central\",VLOOKUP('Seeding Plan'!$B55,WC_Dates,8,FALSE),IF('Seeding Plan'!$C$8=\"Central\",VLOOKUP('Seeding Plan'!$B55,C_Dates,8,FALSE), IF('Seeding Plan'!$C$8=\"East_Central\",VLOOKUP('Seeding Plan'!$B55,EC_Dates,8,FALSE), IF('Seeding Plan'!$C$8=\"Southwest\",VLOOKUP('Seeding Plan'!$B55,SW_Dates,8,FALSE), IF('Seeding Plan'!$C$8=\"South_Central\",VLOOKUP('Seeding Plan'!$B55,SC_Dates,8,FALSE),IF('Seeding Plan'!$C$8=\"Southeast\",VLOOKUP('Seeding Plan'!$B55,SE_Dates,8,FALSE)))))))))))","v":""},{"$f":"IF('Seeding Plan'!$B55=\"\",\"\",IF('Seeding Plan'!$C$8=\"Northwest\",VLOOKUP('Seeding Plan'!$B55,NW_Dates,9,FALSE),IF('Seeding Plan'!$C$8=\"North_Central\",VLOOKUP('Seeding Plan'!$B55,NC_Dates,9,FALSE),IF('Seeding Plan'!$C$8=\"Northeast\",VLOOKUP('Seeding Plan'!$B55,NE_Dates,9,FALSE),IF('Seeding Plan'!$C$8=\"West_Central\",VLOOKUP('Seeding Plan'!$B55,WC_Dates,9,FALSE),IF('Seeding Plan'!$C$8=\"Central\",VLOOKUP('Seeding Plan'!$B55,C_Dates,9,FALSE), IF('Seeding Plan'!$C$8=\"East_Central\",VLOOKUP('Seeding Plan'!$B55,EC_Dates,9,FALSE), IF('Seeding Plan'!$C$8=\"Southwest\",VLOOKUP('Seeding Plan'!$B55,SW_Dates,9,FALSE), IF('Seeding Plan'!$C$8=\"South_Central\",VLOOKUP('Seeding Plan'!$B55,SC_Dates,9,FALSE),IF('Seeding Plan'!$C$8=\"Southeast\",VLOOKUP('Seeding Plan'!$B55,SE_Dates,9,FALSE)))))))))))","v":""}]
["Clover, Crimson","2021-04-01","2021-04-14","2021-05-18","-","-","2021-08-06","2021-08-26","2021-09-09",null,"Min",{"$f":"MIN(L107:L126)","v":"00:00:00"},{"$f":"MIN(M107:M126)","v":"00:00:00"},"00:00:00","00:00:00","00:00:00","00:00:00","00:00:00","00:00:00"]
["Clover, Red","2021-03-18","2021-04-01","2021-05-18","-","-","2021-08-06","2021-09-09","2021-09-16",null,"Max",{"$f":"MAX(L107:L126)","v":"00:00:00"},{"$f":"MAX(M107:M126)","v":"00:00:00"},"00:00:00","00:00:00","00:00:00","00:00:00","00:00:00","00:00:00"]
["Clover, White","2021-03-18","2021-04-01","2021-05-18","-","-","2021-08-06","2021-09-09","2021-09-16"]
["Cowpea","-","2021-05-12","2021-08-06","-","-","-","-","-",null,null,"Reference Table ONLY"]
["Flax","2021-03-18","2021-04-01","2021-05-12","2021-06-01","2021-07-17","2021-08-06","2021-09-09","2021-09-22"]
["Kale","2021-03-18","2021-04-01","2021-05-14","-","2021-07-03","2021-07-24","2021-09-09","2021-09-22",null,{"$f":"+'Seeding Plan'!B65","v":""},{"$f":"IF(L107=\"-\",M107,L107)","v":""},{"$f":"IF('Seeding Plan'!B65=\"\",\"\",IF('Seeding Plan'!$C$8=\"Northwest\",VLOOKUP('Seeding Plan'!$B65,NW_Dates,3,FALSE),IF('Seeding Plan'!$C$8=\"North_Central\",VLOOKUP('Seeding Plan'!$B65,NC_Dates,3,FALSE),IF('Seeding Plan'!$C$8=\"Northeast\",VLOOKUP('Seeding Plan'!$B65,NE_Dates,3,FALSE),IF('Seeding Plan'!$C$8=\"West_Central\",VLOOKUP('Seeding Plan'!$B65,WC_Dates,3,FALSE),IF('Seeding Plan'!$C$8=\"Central\",VLOOKUP('Seeding Plan'!$B65,C_Dates,3,FALSE), IF('Seeding Plan'!$C$8=\"East_Central\",VLOOKUP('Seeding Plan'!$B65,EC_Dates,3,FALSE), IF('Seeding Plan'!$C$8=\"Southwest\",VLOOKUP('Seeding Plan'!$B65,SW_Dates,3,FALSE), IF('Seeding Plan'!$C$8=\"South_Central\",VLOOKUP('Seeding Plan'!$B65,SC_Dates,3,FALSE),IF('Seeding Plan'!$C$8=\"Southeast\",VLOOKUP('Seeding Plan'!$B65,SE_Dates,3,FALSE)))))))))))","v":""},{"$f":"IF('Seeding Plan'!$B65=\"\",\"\",IF('Seeding Plan'!$C$8=\"Northwest\",VLOOKUP('Seeding Plan'!$B65,NW_Dates,4,FALSE),IF('Seeding Plan'!$C$8=\"North_Central\",VLOOKUP('Seeding Plan'!$B65,NC_Dates,4,FALSE),IF('Seeding Plan'!$C$8=\"Northeast\",VLOOKUP('Seeding Plan'!$B65,NE_Dates,4,FALSE),IF('Seeding Plan'!$C$8=\"West_Central\",VLOOKUP('Seeding Plan'!$B65,WC_Dates,4,FALSE),IF('Seeding Plan'!$C$8=\"Central\",VLOOKUP('Seeding Plan'!$B65,C_Dates,4,FALSE), IF('Seeding Plan'!$C$8=\"East_Central\",VLOOKUP('Seeding Plan'!$B65,EC_Dates,4,FALSE), IF('Seeding Plan'!$C$8=\"Southwest\",VLOOKUP('Seeding Plan'!$B65,SW_Dates,4,FALSE), IF('Seeding Plan'!$C$8=\"South_Central\",VLOOKUP('Seeding Plan'!$B65,SC_Dates,4,FALSE),IF('Seeding Plan'!$C$8=\"Southeast\",VLOOKUP('Seeding Plan'!$B65,SE_Dates,4,FALSE)))))))))))","v":""},{"$f":"IF(O107=\"-\",N107,O107)","v":""},{"$f":"IF(P107=\"-\",Q107,P107)","v":""},{"$f":"IF('Seeding Plan'!$B65=\"\",\"\",IF('Seeding Plan'!$C$8=\"Northwest\",VLOOKUP('Seeding Plan'!$B65,NW_Dates,7,FALSE),IF('Seeding Plan'!$C$8=\"North_Central\",VLOOKUP('Seeding Plan'!$B65,NC_Dates,7,FALSE),IF('Seeding Plan'!$C$8=\"Northeast\",VLOOKUP('Seeding Plan'!$B65,NE_Dates,7,FALSE),IF('Seeding Plan'!$C$8=\"West_Central\",VLOOKUP('Seeding Plan'!$B65,WC_Dates,7,FALSE),IF('Seeding Plan'!$C$8=\"Central\",VLOOKUP('Seeding Plan'!$B65,C_Dates,7,FALSE), IF('Seeding Plan'!$C$8=\"East_Central\",VLOOKUP('Seeding Plan'!$B65,EC_Dates,7,FALSE), IF('Seeding Plan'!$C$8=\"Southwest\",VLOOKUP('Seeding Plan'!$B65,SW_Dates,7,FALSE), IF('Seeding Plan'!$C$8=\"South_Central\",VLOOKUP('Seeding Plan'!$B65,SC_Dates,7,FALSE),IF('Seeding Plan'!$C$8=\"Southeast\",VLOOKUP('Seeding Plan'!$B65,SE_Dates,7,FALSE)))))))))))","v":""},{"$f":"IF('Seeding Plan'!$B65=\"\",\"\",IF('Seeding Plan'!$C$8=\"Northwest\",VLOOKUP('Seeding Plan'!$B65,NW_Dates,8,FALSE),IF('Seeding Plan'!$C$8=\"North_Central\",VLOOKUP('Seeding Plan'!$B65,NC_Dates,8,FALSE),IF('Seeding Plan'!$C$8=\"Northeast\",VLOOKUP('Seeding Plan'!$B65,NE_Dates,8,FALSE),IF('Seeding Plan'!$C$8=\"West_Central\",VLOOKUP('Seeding Plan'!$B65,WC_Dates,8,FALSE),IF('Seeding Plan'!$C$8=\"Central\",VLOOKUP('Seeding Plan'!$B65,C_Dates,8,FALSE), IF('Seeding Plan'!$C$8=\"East_Central\",VLOOKUP('Seeding Plan'!$B65,EC_Dates,8,FALSE), IF('Seeding Plan'!$C$8=\"Southwest\",VLOOKUP('Seeding Plan'!$B65,SW_Dates,8,FALSE), IF('Seeding Plan'!$C$8=\"South_Central\",VLOOKUP('Seeding Plan'!$B65,SC_Dates,8,FALSE),IF('Seeding Plan'!$C$8=\"Southeast\",VLOOKUP('Seeding Plan'!$B65,SE_Dates,8,FALSE)))))))))))","v":""},{"$f":"IF(S107=\"-\",R107,S107)","v":""}]
["Millet","-","2021-05-12","2021-08-06","-","-","-","-","-",null,{"$f":"+'Seeding Plan'!B66","v":""},"",{"$f":"IF('Seeding Plan'!B66=\"\",\"\",IF('Seeding Plan'!$C$8=\"Northwest\",VLOOKUP('Seeding Plan'!$B66,NW_Dates,3,FALSE),IF('Seeding Plan'!$C$8=\"North_Central\",VLOOKUP('Seeding Plan'!$B66,NC_Dates,3,FALSE),IF('Seeding Plan'!$C$8=\"Northeast\",VLOOKUP('Seeding Plan'!$B66,NE_Dates,3,FALSE),IF('Seeding Plan'!$C$8=\"West_Central\",VLOOKUP('Seeding Plan'!$B66,WC_Dates,3,FALSE),IF('Seeding Plan'!$C$8=\"Central\",VLOOKUP('Seeding Plan'!$B66,C_Dates,3,FALSE), IF('Seeding Plan'!$C$8=\"East_Central\",VLOOKUP('Seeding Plan'!$B66,EC_Dates,3,FALSE), IF('Seeding Plan'!$C$8=\"Southwest\",VLOOKUP('Seeding Plan'!$B66,SW_Dates,3,FALSE), IF('Seeding Plan'!$C$8=\"South_Central\",VLOOKUP('Seeding Plan'!$B66,SC_Dates,3,FALSE),IF('Seeding Plan'!$C$8=\"Southeast\",VLOOKUP('Seeding Plan'!$B66,SE_Dates,3,FALSE)))))))))))","v":""},{"$f":"IF('Seeding Plan'!$B66=\"\",\"\",IF('Seeding Plan'!$C$8=\"Northwest\",VLOOKUP('Seeding Plan'!$B66,NW_Dates,4,FALSE),IF('Seeding Plan'!$C$8=\"North_Central\",VLOOKUP('Seeding Plan'!$B66,NC_Dates,4,FALSE),IF('Seeding Plan'!$C$8=\"Northeast\",VLOOKUP('Seeding Plan'!$B66,NE_Dates,4,FALSE),IF('Seeding Plan'!$C$8=\"West_Central\",VLOOKUP('Seeding Plan'!$B66,WC_Dates,4,FALSE),IF('Seeding Plan'!$C$8=\"Central\",VLOOKUP('Seeding Plan'!$B66,C_Dates,4,FALSE), IF('Seeding Plan'!$C$8=\"East_Central\",VLOOKUP('Seeding Plan'!$B66,EC_Dates,4,FALSE), IF('Seeding Plan'!$C$8=\"Southwest\",VLOOKUP('Seeding Plan'!$B66,SW_Dates,4,FALSE), IF('Seeding Plan'!$C$8=\"South_Central\",VLOOKUP('Seeding Plan'!$B66,SC_Dates,4,FALSE),IF('Seeding Plan'!$C$8=\"Southeast\",VLOOKUP('Seeding Plan'!$B66,SE_Dates,4,FALSE)))))))))))","v":""},"","",{"$f":"IF('Seeding Plan'!$B66=\"\",\"\",IF('Seeding Plan'!$C$8=\"Northwest\",VLOOKUP('Seeding Plan'!$B66,NW_Dates,7,FALSE),IF('Seeding Plan'!$C$8=\"North_Central\",VLOOKUP('Seeding Plan'!$B66,NC_Dates,7,FALSE),IF('Seeding Plan'!$C$8=\"Northeast\",VLOOKUP('Seeding Plan'!$B66,NE_Dates,7,FALSE),IF('Seeding Plan'!$C$8=\"West_Central\",VLOOKUP('Seeding Plan'!$B66,WC_Dates,7,FALSE),IF('Seeding Plan'!$C$8=\"Central\",VLOOKUP('Seeding Plan'!$B66,C_Dates,7,FALSE), IF('Seeding Plan'!$C$8=\"East_Central\",VLOOKUP('Seeding Plan'!$B66,EC_Dates,7,FALSE), IF('Seeding Plan'!$C$8=\"Southwest\",VLOOKUP('Seeding Plan'!$B66,SW_Dates,7,FALSE), IF('Seeding Plan'!$C$8=\"South_Central\",VLOOKUP('Seeding Plan'!$B66,SC_Dates,7,FALSE),IF('Seeding Plan'!$C$8=\"Southeast\",VLOOKUP('Seeding Plan'!$B66,SE_Dates,7,FALSE)))))))))))","v":""},{"$f":"IF('Seeding Plan'!$B66=\"\",\"\",IF('Seeding Plan'!$C$8=\"Northwest\",VLOOKUP('Seeding Plan'!$B66,NW_Dates,8,FALSE),IF('Seeding Plan'!$C$8=\"North_Central\",VLOOKUP('Seeding Plan'!$B66,NC_Dates,8,FALSE),IF('Seeding Plan'!$C$8=\"Northeast\",VLOOKUP('Seeding Plan'!$B66,NE_Dates,8,FALSE),IF('Seeding Plan'!$C$8=\"West_Central\",VLOOKUP('Seeding Plan'!$B66,WC_Dates,8,FALSE),IF('Seeding Plan'!$C$8=\"Central\",VLOOKUP('Seeding Plan'!$B66,C_Dates,8,FALSE), IF('Seeding Plan'!$C$8=\"East_Central\",VLOOKUP('Seeding Plan'!$B66,EC_Dates,8,FALSE), IF('Seeding Plan'!$C$8=\"Southwest\",VLOOKUP('Seeding Plan'!$B66,SW_Dates,8,FALSE), IF('Seeding Plan'!$C$8=\"South_Central\",VLOOKUP('Seeding Plan'!$B66,SC_Dates,8,FALSE),IF('Seeding Plan'!$C$8=\"Southeast\",VLOOKUP('Seeding Plan'!$B66,SE_Dates,8,FALSE)))))))))))","v":""},""]
["Mustard","2021-03-18","2021-04-01","2021-05-14","-","-","2021-08-06","2021-09-09","2021-09-22",null,{"$f":"+'Seeding Plan'!B67","v":""},"",{"$f":"IF('Seeding Plan'!B67=\"\",\"\",IF('Seeding Plan'!$C$8=\"Northwest\",VLOOKUP('Seeding Plan'!$B67,NW_Dates,3,FALSE),IF('Seeding Plan'!$C$8=\"North_Central\",VLOOKUP('Seeding Plan'!$B67,NC_Dates,3,FALSE),IF('Seeding Plan'!$C$8=\"Northeast\",VLOOKUP('Seeding Plan'!$B67,NE_Dates,3,FALSE),IF('Seeding Plan'!$C$8=\"West_Central\",VLOOKUP('Seeding Plan'!$B67,WC_Dates,3,FALSE),IF('Seeding Plan'!$C$8=\"Central\",VLOOKUP('Seeding Plan'!$B67,C_Dates,3,FALSE), IF('Seeding Plan'!$C$8=\"East_Central\",VLOOKUP('Seeding Plan'!$B67,EC_Dates,3,FALSE), IF('Seeding Plan'!$C$8=\"Southwest\",VLOOKUP('Seeding Plan'!$B67,SW_Dates,3,FALSE), IF('Seeding Plan'!$C$8=\"South_Central\",VLOOKUP('Seeding Plan'!$B67,SC_Dates,3,FALSE),IF('Seeding Plan'!$C$8=\"Southeast\",VLOOKUP('Seeding Plan'!$B67,SE_Dates,3,FALSE)))))))))))","v":""},{"$f":"IF('Seeding Plan'!$B67=\"\",\"\",IF('Seeding Plan'!$C$8=\"Northwest\",VLOOKUP('Seeding Plan'!$B67,NW_Dates,4,FALSE),IF('Seeding Plan'!$C$8=\"North_Central\",VLOOKUP('Seeding Plan'!$B67,NC_Dates,4,FALSE),IF('Seeding Plan'!$C$8=\"Northeast\",VLOOKUP('Seeding Plan'!$B67,NE_Dates,4,FALSE),IF('Seeding Plan'!$C$8=\"West_Central\",VLOOKUP('Seeding Plan'!$B67,WC_Dates,4,FALSE),IF('Seeding Plan'!$C$8=\"Central\",VLOOKUP('Seeding Plan'!$B67,C_Dates,4,FALSE), IF('Seeding Plan'!$C$8=\"East_Central\",VLOOKUP('Seeding Plan'!$B67,EC_Dates,4,FALSE), IF('Seeding Plan'!$C$8=\"Southwest\",VLOOKUP('Seeding Plan'!$B67,SW_Dates,4,FALSE), IF('Seeding Plan'!$C$8=\"South_Central\",VLOOKUP('Seeding Plan'!$B67,SC_Dates,4,FALSE),IF('Seeding Plan'!$C$8=\"Southeast\",VLOOKUP('Seeding Plan'!$B67,SE_Dates,4,FALSE)))))))))))","v":""},"","",{"$f":"IF('Seeding Plan'!$B67=\"\",\"\",IF('Seeding Plan'!$C$8=\"Northwest\",VLOOKUP('Seeding Plan'!$B67,NW_Dates,7,FALSE),IF('Seeding Plan'!$C$8=\"North_Central\",VLOOKUP('Seeding Plan'!$B67,NC_Dates,7,FALSE),IF('Seeding Plan'!$C$8=\"Northeast\",VLOOKUP('Seeding Plan'!$B67,NE_Dates,7,FALSE),IF('Seeding Plan'!$C$8=\"West_Central\",VLOOKUP('Seeding Plan'!$B67,WC_Dates,7,FALSE),IF('Seeding Plan'!$C$8=\"Central\",VLOOKUP('Seeding Plan'!$B67,C_Dates,7,FALSE), IF('Seeding Plan'!$C$8=\"East_Central\",VLOOKUP('Seeding Plan'!$B67,EC_Dates,7,FALSE), IF('Seeding Plan'!$C$8=\"Southwest\",VLOOKUP('Seeding Plan'!$B67,SW_Dates,7,FALSE), IF('Seeding Plan'!$C$8=\"South_Central\",VLOOKUP('Seeding Plan'!$B67,SC_Dates,7,FALSE),IF('Seeding Plan'!$C$8=\"Southeast\",VLOOKUP('Seeding Plan'!$B67,SE_Dates,7,FALSE)))))))))))","v":""},{"$f":"IF('Seeding Plan'!$B67=\"\",\"\",IF('Seeding Plan'!$C$8=\"Northwest\",VLOOKUP('Seeding Plan'!$B67,NW_Dates,8,FALSE),IF('Seeding Plan'!$C$8=\"North_Central\",VLOOKUP('Seeding Plan'!$B67,NC_Dates,8,FALSE),IF('Seeding Plan'!$C$8=\"Northeast\",VLOOKUP('Seeding Plan'!$B67,NE_Dates,8,FALSE),IF('Seeding Plan'!$C$8=\"West_Central\",VLOOKUP('Seeding Plan'!$B67,WC_Dates,8,FALSE),IF('Seeding Plan'!$C$8=\"Central\",VLOOKUP('Seeding Plan'!$B67,C_Dates,8,FALSE), IF('Seeding Plan'!$C$8=\"East_Central\",VLOOKUP('Seeding Plan'!$B67,EC_Dates,8,FALSE), IF('Seeding Plan'!$C$8=\"Southwest\",VLOOKUP('Seeding Plan'!$B67,SW_Dates,8,FALSE), IF('Seeding Plan'!$C$8=\"South_Central\",VLOOKUP('Seeding Plan'!$B67,SC_Dates,8,FALSE),IF('Seeding Plan'!$C$8=\"Southeast\",VLOOKUP('Seeding Plan'!$B67,SE_Dates,8,FALSE)))))))))))","v":""},""]
["Oats","2021-03-18","2021-04-01","2021-04-28",{"$f":"I135","v":"2021-09-22"},{"$f":"B135","v":"2021-03-18"},"2021-08-20","2021-09-09","2021-09-22",null,{"$f":"+'Seeding Plan'!B68","v":""},"",{"$f":"IF('Seeding Plan'!B68=\"\",\"\",IF('Seeding Plan'!$C$8=\"Northwest\",VLOOKUP('Seeding Plan'!$B68,NW_Dates,3,FALSE),IF('Seeding Plan'!$C$8=\"North_Central\",VLOOKUP('Seeding Plan'!$B68,NC_Dates,3,FALSE),IF('Seeding Plan'!$C$8=\"Northeast\",VLOOKUP('Seeding Plan'!$B68,NE_Dates,3,FALSE),IF('Seeding Plan'!$C$8=\"West_Central\",VLOOKUP('Seeding Plan'!$B68,WC_Dates,3,FALSE),IF('Seeding Plan'!$C$8=\"Central\",VLOOKUP('Seeding Plan'!$B68,C_Dates,3,FALSE), IF('Seeding Plan'!$C$8=\"East_Central\",VLOOKUP('Seeding Plan'!$B68,EC_Dates,3,FALSE), IF('Seeding Plan'!$C$8=\"Southwest\",VLOOKUP('Seeding Plan'!$B68,SW_Dates,3,FALSE), IF('Seeding Plan'!$C$8=\"South_Central\",VLOOKUP('Seeding Plan'!$B68,SC_Dates,3,FALSE),IF('Seeding Plan'!$C$8=\"Southeast\",VLOOKUP('Seeding Plan'!$B68,SE_Dates,3,FALSE)))))))))))","v":""},{"$f":"IF('Seeding Plan'!$B68=\"\",\"\",IF('Seeding Plan'!$C$8=\"Northwest\",VLOOKUP('Seeding Plan'!$B68,NW_Dates,4,FALSE),IF('Seeding Plan'!$C$8=\"North_Central\",VLOOKUP('Seeding Plan'!$B68,NC_Dates,4,FALSE),IF('Seeding Plan'!$C$8=\"Northeast\",VLOOKUP('Seeding Plan'!$B68,NE_Dates,4,FALSE),IF('Seeding Plan'!$C$8=\"West_Central\",VLOOKUP('Seeding Plan'!$B68,WC_Dates,4,FALSE),IF('Seeding Plan'!$C$8=\"Central\",VLOOKUP('Seeding Plan'!$B68,C_Dates,4,FALSE), IF('Seeding Plan'!$C$8=\"East_Central\",VLOOKUP('Seeding Plan'!$B68,EC_Dates,4,FALSE), IF('Seeding Plan'!$C$8=\"Southwest\",VLOOKUP('Seeding Plan'!$B68,SW_Dates,4,FALSE), IF('Seeding Plan'!$C$8=\"South_Central\",VLOOKUP('Seeding Plan'!$B68,SC_Dates,4,FALSE),IF('Seeding Plan'!$C$8=\"Southeast\",VLOOKUP('Seeding Plan'!$B68,SE_Dates,4,FALSE)))))))))))","v":""},"","",{"$f":"IF('Seeding Plan'!$B68=\"\",\"\",IF('Seeding Plan'!$C$8=\"Northwest\",VLOOKUP('Seeding Plan'!$B68,NW_Dates,7,FALSE),IF('Seeding Plan'!$C$8=\"North_Central\",VLOOKUP('Seeding Plan'!$B68,NC_Dates,7,FALSE),IF('Seeding Plan'!$C$8=\"Northeast\",VLOOKUP('Seeding Plan'!$B68,NE_Dates,7,FALSE),IF('Seeding Plan'!$C$8=\"West_Central\",VLOOKUP('Seeding Plan'!$B68,WC_Dates,7,FALSE),IF('Seeding Plan'!$C$8=\"Central\",VLOOKUP('Seeding Plan'!$B68,C_Dates,7,FALSE), IF('Seeding Plan'!$C$8=\"East_Central\",VLOOKUP('Seeding Plan'!$B68,EC_Dates,7,FALSE), IF('Seeding Plan'!$C$8=\"Southwest\",VLOOKUP('Seeding Plan'!$B68,SW_Dates,7,FALSE), IF('Seeding Plan'!$C$8=\"South_Central\",VLOOKUP('Seeding Plan'!$B68,SC_Dates,7,FALSE),IF('Seeding Plan'!$C$8=\"Southeast\",VLOOKUP('Seeding Plan'!$B68,SE_Dates,7,FALSE)))))))))))","v":""},{"$f":"IF('Seeding Plan'!$B68=\"\",\"\",IF('Seeding Plan'!$C$8=\"Northwest\",VLOOKUP('Seeding Plan'!$B68,NW_Dates,8,FALSE),IF('Seeding Plan'!$C$8=\"North_Central\",VLOOKUP('Seeding Plan'!$B68,NC_Dates,8,FALSE),IF('Seeding Plan'!$C$8=\"Northeast\",VLOOKUP('Seeding Plan'!$B68,NE_Dates,8,FALSE),IF('Seeding Plan'!$C$8=\"West_Central\",VLOOKUP('Seeding Plan'!$B68,WC_Dates,8,FALSE),IF('Seeding Plan'!$C$8=\"Central\",VLOOKUP('Seeding Plan'!$B68,C_Dates,8,FALSE), IF('Seeding Plan'!$C$8=\"East_Central\",VLOOKUP('Seeding Plan'!$B68,EC_Dates,8,FALSE), IF('Seeding Plan'!$C$8=\"Southwest\",VLOOKUP('Seeding Plan'!$B68,SW_Dates,8,FALSE), IF('Seeding Plan'!$C$8=\"South_Central\",VLOOKUP('Seeding Plan'!$B68,SC_Dates,8,FALSE),IF('Seeding Plan'!$C$8=\"Southeast\",VLOOKUP('Seeding Plan'!$B68,SE_Dates,8,FALSE)))))))))))","v":""},""]
["Pea, Field/Winter","-","2021-04-01","2021-05-18","-","-","2021-08-06","2021-08-26","2021-09-09",null,{"$f":"+'Seeding Plan'!B69","v":""},"",{"$f":"IF('Seeding Plan'!B69=\"\",\"\",IF('Seeding Plan'!$C$8=\"Northwest\",VLOOKUP('Seeding Plan'!$B69,NW_Dates,3,FALSE),IF('Seeding Plan'!$C$8=\"North_Central\",VLOOKUP('Seeding Plan'!$B69,NC_Dates,3,FALSE),IF('Seeding Plan'!$C$8=\"Northeast\",VLOOKUP('Seeding Plan'!$B69,NE_Dates,3,FALSE),IF('Seeding Plan'!$C$8=\"West_Central\",VLOOKUP('Seeding Plan'!$B69,WC_Dates,3,FALSE),IF('Seeding Plan'!$C$8=\"Central\",VLOOKUP('Seeding Plan'!$B69,C_Dates,3,FALSE), IF('Seeding Plan'!$C$8=\"East_Central\",VLOOKUP('Seeding Plan'!$B69,EC_Dates,3,FALSE), IF('Seeding Plan'!$C$8=\"Southwest\",VLOOKUP('Seeding Plan'!$B69,SW_Dates,3,FALSE), IF('Seeding Plan'!$C$8=\"South_Central\",VLOOKUP('Seeding Plan'!$B69,SC_Dates,3,FALSE),IF('Seeding Plan'!$C$8=\"Southeast\",VLOOKUP('Seeding Plan'!$B69,SE_Dates,3,FALSE)))))))))))","v":""},{"$f":"IF('Seeding Plan'!$B69=\"\",\"\",IF('Seeding Plan'!$C$8=\"Northwest\",VLOOKUP('Seeding Plan'!$B69,NW_Dates,4,FALSE),IF('Seeding Plan'!$C$8=\"North_Central\",VLOOKUP('Seeding Plan'!$B69,NC_Dates,4,FALSE),IF('Seeding Plan'!$C$8=\"Northeast\",VLOOKUP('Seeding Plan'!$B69,NE_Dates,4,FALSE),IF('Seeding Plan'!$C$8=\"West_Central\",VLOOKUP('Seeding Plan'!$B69,WC_Dates,4,FALSE),IF('Seeding Plan'!$C$8=\"Central\",VLOOKUP('Seeding Plan'!$B69,C_Dates,4,FALSE), IF('Seeding Plan'!$C$8=\"East_Central\",VLOOKUP('Seeding Plan'!$B69,EC_Dates,4,FALSE), IF('Seeding Plan'!$C$8=\"Southwest\",VLOOKUP('Seeding Plan'!$B69,SW_Dates,4,FALSE), IF('Seeding Plan'!$C$8=\"South_Central\",VLOOKUP('Seeding Plan'!$B69,SC_Dates,4,FALSE),IF('Seeding Plan'!$C$8=\"Southeast\",VLOOKUP('Seeding Plan'!$B69,SE_Dates,4,FALSE)))))))))))","v":""},"","",{"$f":"IF('Seeding Plan'!$B69=\"\",\"\",IF('Seeding Plan'!$C$8=\"Northwest\",VLOOKUP('Seeding Plan'!$B69,NW_Dates,7,FALSE),IF('Seeding Plan'!$C$8=\"North_Central\",VLOOKUP('Seeding Plan'!$B69,NC_Dates,7,FALSE),IF('Seeding Plan'!$C$8=\"Northeast\",VLOOKUP('Seeding Plan'!$B69,NE_Dates,7,FALSE),IF('Seeding Plan'!$C$8=\"West_Central\",VLOOKUP('Seeding Plan'!$B69,WC_Dates,7,FALSE),IF('Seeding Plan'!$C$8=\"Central\",VLOOKUP('Seeding Plan'!$B69,C_Dates,7,FALSE), IF('Seeding Plan'!$C$8=\"East_Central\",VLOOKUP('Seeding Plan'!$B69,EC_Dates,7,FALSE), IF('Seeding Plan'!$C$8=\"Southwest\",VLOOKUP('Seeding Plan'!$B69,SW_Dates,7,FALSE), IF('Seeding Plan'!$C$8=\"South_Central\",VLOOKUP('Seeding Plan'!$B69,SC_Dates,7,FALSE),IF('Seeding Plan'!$C$8=\"Southeast\",VLOOKUP('Seeding Plan'!$B69,SE_Dates,7,FALSE)))))))))))","v":""},{"$f":"IF('Seeding Plan'!$B69=\"\",\"\",IF('Seeding Plan'!$C$8=\"Northwest\",VLOOKUP('Seeding Plan'!$B69,NW_Dates,8,FALSE),IF('Seeding Plan'!$C$8=\"North_Central\",VLOOKUP('Seeding Plan'!$B69,NC_Dates,8,FALSE),IF('Seeding Plan'!$C$8=\"Northeast\",VLOOKUP('Seeding Plan'!$B69,NE_Dates,8,FALSE),IF('Seeding Plan'!$C$8=\"West_Central\",VLOOKUP('Seeding Plan'!$B69,WC_Dates,8,FALSE),IF('Seeding Plan'!$C$8=\"Central\",VLOOKUP('Seeding Plan'!$B69,C_Dates,8,FALSE), IF('Seeding Plan'!$C$8=\"East_Central\",VLOOKUP('Seeding Plan'!$B69,EC_Dates,8,FALSE), IF('Seeding Plan'!$C$8=\"Southwest\",VLOOKUP('Seeding Plan'!$B69,SW_Dates,8,FALSE), IF('Seeding Plan'!$C$8=\"South_Central\",VLOOKUP('Seeding Plan'!$B69,SC_Dates,8,FALSE),IF('Seeding Plan'!$C$8=\"Southeast\",VLOOKUP('Seeding Plan'!$B69,SE_Dates,8,FALSE)))))))))))","v":""},""]
["Radish","2021-04-01","--","--",{"$f":"I137","v":"2021-09-22"},{"$f":"B137","v":"2021-04-01"},"2021-08-06","2021-09-09","2021-09-22",null,{"$f":"+'Seeding Plan'!B70","v":""},"",{"$f":"IF('Seeding Plan'!B70=\"\",\"\",IF('Seeding Plan'!$C$8=\"Northwest\",VLOOKUP('Seeding Plan'!$B70,NW_Dates,3,FALSE),IF('Seeding Plan'!$C$8=\"North_Central\",VLOOKUP('Seeding Plan'!$B70,NC_Dates,3,FALSE),IF('Seeding Plan'!$C$8=\"Northeast\",VLOOKUP('Seeding Plan'!$B70,NE_Dates,3,FALSE),IF('Seeding Plan'!$C$8=\"West_Central\",VLOOKUP('Seeding Plan'!$B70,WC_Dates,3,FALSE),IF('Seeding Plan'!$C$8=\"Central\",VLOOKUP('Seeding Plan'!$B70,C_Dates,3,FALSE), IF('Seeding Plan'!$C$8=\"East_Central\",VLOOKUP('Seeding Plan'!$B70,EC_Dates,3,FALSE), IF('Seeding Plan'!$C$8=\"Southwest\",VLOOKUP('Seeding Plan'!$B70,SW_Dates,3,FALSE), IF('Seeding Plan'!$C$8=\"South_Central\",VLOOKUP('Seeding Plan'!$B70,SC_Dates,3,FALSE),IF('Seeding Plan'!$C$8=\"Southeast\",VLOOKUP('Seeding Plan'!$B70,SE_Dates,3,FALSE)))))))))))","v":""},{"$f":"IF('Seeding Plan'!$B70=\"\",\"\",IF('Seeding Plan'!$C$8=\"Northwest\",VLOOKUP('Seeding Plan'!$B70,NW_Dates,4,FALSE),IF('Seeding Plan'!$C$8=\"North_Central\",VLOOKUP('Seeding Plan'!$B70,NC_Dates,4,FALSE),IF('Seeding Plan'!$C$8=\"Northeast\",VLOOKUP('Seeding Plan'!$B70,NE_Dates,4,FALSE),IF('Seeding Plan'!$C$8=\"West_Central\",VLOOKUP('Seeding Plan'!$B70,WC_Dates,4,FALSE),IF('Seeding Plan'!$C$8=\"Central\",VLOOKUP('Seeding Plan'!$B70,C_Dates,4,FALSE), IF('Seeding Plan'!$C$8=\"East_Central\",VLOOKUP('Seeding Plan'!$B70,EC_Dates,4,FALSE), IF('Seeding Plan'!$C$8=\"Southwest\",VLOOKUP('Seeding Plan'!$B70,SW_Dates,4,FALSE), IF('Seeding Plan'!$C$8=\"South_Central\",VLOOKUP('Seeding Plan'!$B70,SC_Dates,4,FALSE),IF('Seeding Plan'!$C$8=\"Southeast\",VLOOKUP('Seeding Plan'!$B70,SE_Dates,4,FALSE)))))))))))","v":""},"","",{"$f":"IF('Seeding Plan'!$B70=\"\",\"\",IF('Seeding Plan'!$C$8=\"Northwest\",VLOOKUP('Seeding Plan'!$B70,NW_Dates,7,FALSE),IF('Seeding Plan'!$C$8=\"North_Central\",VLOOKUP('Seeding Plan'!$B70,NC_Dates,7,FALSE),IF('Seeding Plan'!$C$8=\"Northeast\",VLOOKUP('Seeding Plan'!$B70,NE_Dates,7,FALSE),IF('Seeding Plan'!$C$8=\"West_Central\",VLOOKUP('Seeding Plan'!$B70,WC_Dates,7,FALSE),IF('Seeding Plan'!$C$8=\"Central\",VLOOKUP('Seeding Plan'!$B70,C_Dates,7,FALSE), IF('Seeding Plan'!$C$8=\"East_Central\",VLOOKUP('Seeding Plan'!$B70,EC_Dates,7,FALSE), IF('Seeding Plan'!$C$8=\"Southwest\",VLOOKUP('Seeding Plan'!$B70,SW_Dates,7,FALSE), IF('Seeding Plan'!$C$8=\"South_Central\",VLOOKUP('Seeding Plan'!$B70,SC_Dates,7,FALSE),IF('Seeding Plan'!$C$8=\"Southeast\",VLOOKUP('Seeding Plan'!$B70,SE_Dates,7,FALSE)))))))))))","v":""},{"$f":"IF('Seeding Plan'!$B70=\"\",\"\",IF('Seeding Plan'!$C$8=\"Northwest\",VLOOKUP('Seeding Plan'!$B70,NW_Dates,8,FALSE),IF('Seeding Plan'!$C$8=\"North_Central\",VLOOKUP('Seeding Plan'!$B70,NC_Dates,8,FALSE),IF('Seeding Plan'!$C$8=\"Northeast\",VLOOKUP('Seeding Plan'!$B70,NE_Dates,8,FALSE),IF('Seeding Plan'!$C$8=\"West_Central\",VLOOKUP('Seeding Plan'!$B70,WC_Dates,8,FALSE),IF('Seeding Plan'!$C$8=\"Central\",VLOOKUP('Seeding Plan'!$B70,C_Dates,8,FALSE), IF('Seeding Plan'!$C$8=\"East_Central\",VLOOKUP('Seeding Plan'!$B70,EC_Dates,8,FALSE), IF('Seeding Plan'!$C$8=\"Southwest\",VLOOKUP('Seeding Plan'!$B70,SW_Dates,8,FALSE), IF('Seeding Plan'!$C$8=\"South_Central\",VLOOKUP('Seeding Plan'!$B70,SC_Dates,8,FALSE),IF('Seeding Plan'!$C$8=\"Southeast\",VLOOKUP('Seeding Plan'!$B70,SE_Dates,8,FALSE)))))))))))","v":""},""]
["Rapeseed","2021-03-18","2021-04-01","2021-05-12",{"$f":"I138","v":"2021-09-22"},{"$f":"B138","v":"2021-03-18"},"2021-08-06","2021-09-09","2021-09-22",null,{"$f":"+'Seeding Plan'!B71","v":""},"",{"$f":"IF('Seeding Plan'!B71=\"\",\"\",IF('Seeding Plan'!$C$8=\"Northwest\",VLOOKUP('Seeding Plan'!$B71,NW_Dates,3,FALSE),IF('Seeding Plan'!$C$8=\"North_Central\",VLOOKUP('Seeding Plan'!$B71,NC_Dates,3,FALSE),IF('Seeding Plan'!$C$8=\"Northeast\",VLOOKUP('Seeding Plan'!$B71,NE_Dates,3,FALSE),IF('Seeding Plan'!$C$8=\"West_Central\",VLOOKUP('Seeding Plan'!$B71,WC_Dates,3,FALSE),IF('Seeding Plan'!$C$8=\"Central\",VLOOKUP('Seeding Plan'!$B71,C_Dates,3,FALSE), IF('Seeding Plan'!$C$8=\"East_Central\",VLOOKUP('Seeding Plan'!$B71,EC_Dates,3,FALSE), IF('Seeding Plan'!$C$8=\"Southwest\",VLOOKUP('Seeding Plan'!$B71,SW_Dates,3,FALSE), IF('Seeding Plan'!$C$8=\"South_Central\",VLOOKUP('Seeding Plan'!$B71,SC_Dates,3,FALSE),IF('Seeding Plan'!$C$8=\"Southeast\",VLOOKUP('Seeding Plan'!$B71,SE_Dates,3,FALSE)))))))))))","v":""},{"$f":"IF('Seeding Plan'!$B71=\"\",\"\",IF('Seeding Plan'!$C$8=\"Northwest\",VLOOKUP('Seeding Plan'!$B71,NW_Dates,4,FALSE),IF('Seeding Plan'!$C$8=\"North_Central\",VLOOKUP('Seeding Plan'!$B71,NC_Dates,4,FALSE),IF('Seeding Plan'!$C$8=\"Northeast\",VLOOKUP('Seeding Plan'!$B71,NE_Dates,4,FALSE),IF('Seeding Plan'!$C$8=\"West_Central\",VLOOKUP('Seeding Plan'!$B71,WC_Dates,4,FALSE),IF('Seeding Plan'!$C$8=\"Central\",VLOOKUP('Seeding Plan'!$B71,C_Dates,4,FALSE), IF('Seeding Plan'!$C$8=\"East_Central\",VLOOKUP('Seeding Plan'!$B71,EC_Dates,4,FALSE), IF('Seeding Plan'!$C$8=\"Southwest\",VLOOKUP('Seeding Plan'!$B71,SW_Dates,4,FALSE), IF('Seeding Plan'!$C$8=\"South_Central\",VLOOKUP('Seeding Plan'!$B71,SC_Dates,4,FALSE),IF('Seeding Plan'!$C$8=\"Southeast\",VLOOKUP('Seeding Plan'!$B71,SE_Dates,4,FALSE)))))))))))","v":""},"","",{"$f":"IF('Seeding Plan'!$B71=\"\",\"\",IF('Seeding Plan'!$C$8=\"Northwest\",VLOOKUP('Seeding Plan'!$B71,NW_Dates,7,FALSE),IF('Seeding Plan'!$C$8=\"North_Central\",VLOOKUP('Seeding Plan'!$B71,NC_Dates,7,FALSE),IF('Seeding Plan'!$C$8=\"Northeast\",VLOOKUP('Seeding Plan'!$B71,NE_Dates,7,FALSE),IF('Seeding Plan'!$C$8=\"West_Central\",VLOOKUP('Seeding Plan'!$B71,WC_Dates,7,FALSE),IF('Seeding Plan'!$C$8=\"Central\",VLOOKUP('Seeding Plan'!$B71,C_Dates,7,FALSE), IF('Seeding Plan'!$C$8=\"East_Central\",VLOOKUP('Seeding Plan'!$B71,EC_Dates,7,FALSE), IF('Seeding Plan'!$C$8=\"Southwest\",VLOOKUP('Seeding Plan'!$B71,SW_Dates,7,FALSE), IF('Seeding Plan'!$C$8=\"South_Central\",VLOOKUP('Seeding Plan'!$B71,SC_Dates,7,FALSE),IF('Seeding Plan'!$C$8=\"Southeast\",VLOOKUP('Seeding Plan'!$B71,SE_Dates,7,FALSE)))))))))))","v":""},{"$f":"IF('Seeding Plan'!$B71=\"\",\"\",IF('Seeding Plan'!$C$8=\"Northwest\",VLOOKUP('Seeding Plan'!$B71,NW_Dates,8,FALSE),IF('Seeding Plan'!$C$8=\"North_Central\",VLOOKUP('Seeding Plan'!$B71,NC_Dates,8,FALSE),IF('Seeding Plan'!$C$8=\"Northeast\",VLOOKUP('Seeding Plan'!$B71,NE_Dates,8,FALSE),IF('Seeding Plan'!$C$8=\"West_Central\",VLOOKUP('Seeding Plan'!$B71,WC_Dates,8,FALSE),IF('Seeding Plan'!$C$8=\"Central\",VLOOKUP('Seeding Plan'!$B71,C_Dates,8,FALSE), IF('Seeding Plan'!$C$8=\"East_Central\",VLOOKUP('Seeding Plan'!$B71,EC_Dates,8,FALSE), IF('Seeding Plan'!$C$8=\"Southwest\",VLOOKUP('Seeding Plan'!$B71,SW_Dates,8,FALSE), IF('Seeding Plan'!$C$8=\"South_Central\",VLOOKUP('Seeding Plan'!$B71,SC_Dates,8,FALSE),IF('Seeding Plan'!$C$8=\"Southeast\",VLOOKUP('Seeding Plan'!$B71,SE_Dates,8,FALSE)))))))))))","v":""},""]
["Rye, Winter/Cereal","-","-","-","-","2021-08-06","2021-08-20","2021-10-22","2021-11-03",null,{"$f":"+'Seeding Plan'!B72","v":""},"",{"$f":"IF('Seeding Plan'!B72=\"\",\"\",IF('Seeding Plan'!$C$8=\"Northwest\",VLOOKUP('Seeding Plan'!$B72,NW_Dates,3,FALSE),IF('Seeding Plan'!$C$8=\"North_Central\",VLOOKUP('Seeding Plan'!$B72,NC_Dates,3,FALSE),IF('Seeding Plan'!$C$8=\"Northeast\",VLOOKUP('Seeding Plan'!$B72,NE_Dates,3,FALSE),IF('Seeding Plan'!$C$8=\"West_Central\",VLOOKUP('Seeding Plan'!$B72,WC_Dates,3,FALSE),IF('Seeding Plan'!$C$8=\"Central\",VLOOKUP('Seeding Plan'!$B72,C_Dates,3,FALSE), IF('Seeding Plan'!$C$8=\"East_Central\",VLOOKUP('Seeding Plan'!$B72,EC_Dates,3,FALSE), IF('Seeding Plan'!$C$8=\"Southwest\",VLOOKUP('Seeding Plan'!$B72,SW_Dates,3,FALSE), IF('Seeding Plan'!$C$8=\"South_Central\",VLOOKUP('Seeding Plan'!$B72,SC_Dates,3,FALSE),IF('Seeding Plan'!$C$8=\"Southeast\",VLOOKUP('Seeding Plan'!$B72,SE_Dates,3,FALSE)))))))))))","v":""},{"$f":"IF('Seeding Plan'!$B72=\"\",\"\",IF('Seeding Plan'!$C$8=\"Northwest\",VLOOKUP('Seeding Plan'!$B72,NW_Dates,4,FALSE),IF('Seeding Plan'!$C$8=\"North_Central\",VLOOKUP('Seeding Plan'!$B72,NC_Dates,4,FALSE),IF('Seeding Plan'!$C$8=\"Northeast\",VLOOKUP('Seeding Plan'!$B72,NE_Dates,4,FALSE),IF('Seeding Plan'!$C$8=\"West_Central\",VLOOKUP('Seeding Plan'!$B72,WC_Dates,4,FALSE),IF('Seeding Plan'!$C$8=\"Central\",VLOOKUP('Seeding Plan'!$B72,C_Dates,4,FALSE), IF('Seeding Plan'!$C$8=\"East_Central\",VLOOKUP('Seeding Plan'!$B72,EC_Dates,4,FALSE), IF('Seeding Plan'!$C$8=\"Southwest\",VLOOKUP('Seeding Plan'!$B72,SW_Dates,4,FALSE), IF('Seeding Plan'!$C$8=\"South_Central\",VLOOKUP('Seeding Plan'!$B72,SC_Dates,4,FALSE),IF('Seeding Plan'!$C$8=\"Southeast\",VLOOKUP('Seeding Plan'!$B72,SE_Dates,4,FALSE)))))))))))","v":""},"","",{"$f":"IF('Seeding Plan'!$B72=\"\",\"\",IF('Seeding Plan'!$C$8=\"Northwest\",VLOOKUP('Seeding Plan'!$B72,NW_Dates,7,FALSE),IF('Seeding Plan'!$C$8=\"North_Central\",VLOOKUP('Seeding Plan'!$B72,NC_Dates,7,FALSE),IF('Seeding Plan'!$C$8=\"Northeast\",VLOOKUP('Seeding Plan'!$B72,NE_Dates,7,FALSE),IF('Seeding Plan'!$C$8=\"West_Central\",VLOOKUP('Seeding Plan'!$B72,WC_Dates,7,FALSE),IF('Seeding Plan'!$C$8=\"Central\",VLOOKUP('Seeding Plan'!$B72,C_Dates,7,FALSE), IF('Seeding Plan'!$C$8=\"East_Central\",VLOOKUP('Seeding Plan'!$B72,EC_Dates,7,FALSE), IF('Seeding Plan'!$C$8=\"Southwest\",VLOOKUP('Seeding Plan'!$B72,SW_Dates,7,FALSE), IF('Seeding Plan'!$C$8=\"South_Central\",VLOOKUP('Seeding Plan'!$B72,SC_Dates,7,FALSE),IF('Seeding Plan'!$C$8=\"Southeast\",VLOOKUP('Seeding Plan'!$B72,SE_Dates,7,FALSE)))))))))))","v":""},{"$f":"IF('Seeding Plan'!$B72=\"\",\"\",IF('Seeding Plan'!$C$8=\"Northwest\",VLOOKUP('Seeding Plan'!$B72,NW_Dates,8,FALSE),IF('Seeding Plan'!$C$8=\"North_Central\",VLOOKUP('Seeding Plan'!$B72,NC_Dates,8,FALSE),IF('Seeding Plan'!$C$8=\"Northeast\",VLOOKUP('Seeding Plan'!$B72,NE_Dates,8,FALSE),IF('Seeding Plan'!$C$8=\"West_Central\",VLOOKUP('Seeding Plan'!$B72,WC_Dates,8,FALSE),IF('Seeding Plan'!$C$8=\"Central\",VLOOKUP('Seeding Plan'!$B72,C_Dates,8,FALSE), IF('Seeding Plan'!$C$8=\"East_Central\",VLOOKUP('Seeding Plan'!$B72,EC_Dates,8,FALSE), IF('Seeding Plan'!$C$8=\"Southwest\",VLOOKUP('Seeding Plan'!$B72,SW_Dates,8,FALSE), IF('Seeding Plan'!$C$8=\"South_Central\",VLOOKUP('Seeding Plan'!$B72,SC_Dates,8,FALSE),IF('Seeding Plan'!$C$8=\"Southeast\",VLOOKUP('Seeding Plan'!$B72,SE_Dates,8,FALSE)))))))))))","v":""},""]
["Ryegrass, Annual","-","2021-04-01","2021-05-12","2021-06-15","-","2021-07-17","2021-08-19","2021-09-22",null,{"$f":"+'Seeding Plan'!B73","v":""},"",{"$f":"IF('Seeding Plan'!B73=\"\",\"\",IF('Seeding Plan'!$C$8=\"Northwest\",VLOOKUP('Seeding Plan'!$B73,NW_Dates,3,FALSE),IF('Seeding Plan'!$C$8=\"North_Central\",VLOOKUP('Seeding Plan'!$B73,NC_Dates,3,FALSE),IF('Seeding Plan'!$C$8=\"Northeast\",VLOOKUP('Seeding Plan'!$B73,NE_Dates,3,FALSE),IF('Seeding Plan'!$C$8=\"West_Central\",VLOOKUP('Seeding Plan'!$B73,WC_Dates,3,FALSE),IF('Seeding Plan'!$C$8=\"Central\",VLOOKUP('Seeding Plan'!$B73,C_Dates,3,FALSE), IF('Seeding Plan'!$C$8=\"East_Central\",VLOOKUP('Seeding Plan'!$B73,EC_Dates,3,FALSE), IF('Seeding Plan'!$C$8=\"Southwest\",VLOOKUP('Seeding Plan'!$B73,SW_Dates,3,FALSE), IF('Seeding Plan'!$C$8=\"South_Central\",VLOOKUP('Seeding Plan'!$B73,SC_Dates,3,FALSE),IF('Seeding Plan'!$C$8=\"Southeast\",VLOOKUP('Seeding Plan'!$B73,SE_Dates,3,FALSE)))))))))))","v":""},{"$f":"IF('Seeding Plan'!$B73=\"\",\"\",IF('Seeding Plan'!$C$8=\"Northwest\",VLOOKUP('Seeding Plan'!$B73,NW_Dates,4,FALSE),IF('Seeding Plan'!$C$8=\"North_Central\",VLOOKUP('Seeding Plan'!$B73,NC_Dates,4,FALSE),IF('Seeding Plan'!$C$8=\"Northeast\",VLOOKUP('Seeding Plan'!$B73,NE_Dates,4,FALSE),IF('Seeding Plan'!$C$8=\"West_Central\",VLOOKUP('Seeding Plan'!$B73,WC_Dates,4,FALSE),IF('Seeding Plan'!$C$8=\"Central\",VLOOKUP('Seeding Plan'!$B73,C_Dates,4,FALSE), IF('Seeding Plan'!$C$8=\"East_Central\",VLOOKUP('Seeding Plan'!$B73,EC_Dates,4,FALSE), IF('Seeding Plan'!$C$8=\"Southwest\",VLOOKUP('Seeding Plan'!$B73,SW_Dates,4,FALSE), IF('Seeding Plan'!$C$8=\"South_Central\",VLOOKUP('Seeding Plan'!$B73,SC_Dates,4,FALSE),IF('Seeding Plan'!$C$8=\"Southeast\",VLOOKUP('Seeding Plan'!$B73,SE_Dates,4,FALSE)))))))))))","v":""},"","",{"$f":"IF('Seeding Plan'!$B73=\"\",\"\",IF('Seeding Plan'!$C$8=\"Northwest\",VLOOKUP('Seeding Plan'!$B73,NW_Dates,7,FALSE),IF('Seeding Plan'!$C$8=\"North_Central\",VLOOKUP('Seeding Plan'!$B73,NC_Dates,7,FALSE),IF('Seeding Plan'!$C$8=\"Northeast\",VLOOKUP('Seeding Plan'!$B73,NE_Dates,7,FALSE),IF('Seeding Plan'!$C$8=\"West_Central\",VLOOKUP('Seeding Plan'!$B73,WC_Dates,7,FALSE),IF('Seeding Plan'!$C$8=\"Central\",VLOOKUP('Seeding Plan'!$B73,C_Dates,7,FALSE), IF('Seeding Plan'!$C$8=\"East_Central\",VLOOKUP('Seeding Plan'!$B73,EC_Dates,7,FALSE), IF('Seeding Plan'!$C$8=\"Southwest\",VLOOKUP('Seeding Plan'!$B73,SW_Dates,7,FALSE), IF('Seeding Plan'!$C$8=\"South_Central\",VLOOKUP('Seeding Plan'!$B73,SC_Dates,7,FALSE),IF('Seeding Plan'!$C$8=\"Southeast\",VLOOKUP('Seeding Plan'!$B73,SE_Dates,7,FALSE)))))))))))","v":""},{"$f":"IF('Seeding Plan'!$B73=\"\",\"\",IF('Seeding Plan'!$C$8=\"Northwest\",VLOOKUP('Seeding Plan'!$B73,NW_Dates,8,FALSE),IF('Seeding Plan'!$C$8=\"North_Central\",VLOOKUP('Seeding Plan'!$B73,NC_Dates,8,FALSE),IF('Seeding Plan'!$C$8=\"Northeast\",VLOOKUP('Seeding Plan'!$B73,NE_Dates,8,FALSE),IF('Seeding Plan'!$C$8=\"West_Central\",VLOOKUP('Seeding Plan'!$B73,WC_Dates,8,FALSE),IF('Seeding Plan'!$C$8=\"Central\",VLOOKUP('Seeding Plan'!$B73,C_Dates,8,FALSE), IF('Seeding Plan'!$C$8=\"East_Central\",VLOOKUP('Seeding Plan'!$B73,EC_Dates,8,FALSE), IF('Seeding Plan'!$C$8=\"Southwest\",VLOOKUP('Seeding Plan'!$B73,SW_Dates,8,FALSE), IF('Seeding Plan'!$C$8=\"South_Central\",VLOOKUP('Seeding Plan'!$B73,SC_Dates,8,FALSE),IF('Seeding Plan'!$C$8=\"Southeast\",VLOOKUP('Seeding Plan'!$B73,SE_Dates,8,FALSE)))))))))))","v":""},""]
["Sorghum, Forage","-","2021-05-12","2021-08-06","-","-","-","-","-",null,{"$f":"+'Seeding Plan'!B74","v":""},"",{"$f":"IF('Seeding Plan'!B74=\"\",\"\",IF('Seeding Plan'!$C$8=\"Northwest\",VLOOKUP('Seeding Plan'!$B74,NW_Dates,3,FALSE),IF('Seeding Plan'!$C$8=\"North_Central\",VLOOKUP('Seeding Plan'!$B74,NC_Dates,3,FALSE),IF('Seeding Plan'!$C$8=\"Northeast\",VLOOKUP('Seeding Plan'!$B74,NE_Dates,3,FALSE),IF('Seeding Plan'!$C$8=\"West_Central\",VLOOKUP('Seeding Plan'!$B74,WC_Dates,3,FALSE),IF('Seeding Plan'!$C$8=\"Central\",VLOOKUP('Seeding Plan'!$B74,C_Dates,3,FALSE), IF('Seeding Plan'!$C$8=\"East_Central\",VLOOKUP('Seeding Plan'!$B74,EC_Dates,3,FALSE), IF('Seeding Plan'!$C$8=\"Southwest\",VLOOKUP('Seeding Plan'!$B74,SW_Dates,3,FALSE), IF('Seeding Plan'!$C$8=\"South_Central\",VLOOKUP('Seeding Plan'!$B74,SC_Dates,3,FALSE),IF('Seeding Plan'!$C$8=\"Southeast\",VLOOKUP('Seeding Plan'!$B74,SE_Dates,3,FALSE)))))))))))","v":""},{"$f":"IF('Seeding Plan'!$B74=\"\",\"\",IF('Seeding Plan'!$C$8=\"Northwest\",VLOOKUP('Seeding Plan'!$B74,NW_Dates,4,FALSE),IF('Seeding Plan'!$C$8=\"North_Central\",VLOOKUP('Seeding Plan'!$B74,NC_Dates,4,FALSE),IF('Seeding Plan'!$C$8=\"Northeast\",VLOOKUP('Seeding Plan'!$B74,NE_Dates,4,FALSE),IF('Seeding Plan'!$C$8=\"West_Central\",VLOOKUP('Seeding Plan'!$B74,WC_Dates,4,FALSE),IF('Seeding Plan'!$C$8=\"Central\",VLOOKUP('Seeding Plan'!$B74,C_Dates,4,FALSE), IF('Seeding Plan'!$C$8=\"East_Central\",VLOOKUP('Seeding Plan'!$B74,EC_Dates,4,FALSE), IF('Seeding Plan'!$C$8=\"Southwest\",VLOOKUP('Seeding Plan'!$B74,SW_Dates,4,FALSE), IF('Seeding Plan'!$C$8=\"South_Central\",VLOOKUP('Seeding Plan'!$B74,SC_Dates,4,FALSE),IF('Seeding Plan'!$C$8=\"Southeast\",VLOOKUP('Seeding Plan'!$B74,SE_Dates,4,FALSE)))))))))))","v":""},"","",{"$f":"IF('Seeding Plan'!$B74=\"\",\"\",IF('Seeding Plan'!$C$8=\"Northwest\",VLOOKUP('Seeding Plan'!$B74,NW_Dates,7,FALSE),IF('Seeding Plan'!$C$8=\"North_Central\",VLOOKUP('Seeding Plan'!$B74,NC_Dates,7,FALSE),IF('Seeding Plan'!$C$8=\"Northeast\",VLOOKUP('Seeding Plan'!$B74,NE_Dates,7,FALSE),IF('Seeding Plan'!$C$8=\"West_Central\",VLOOKUP('Seeding Plan'!$B74,WC_Dates,7,FALSE),IF('Seeding Plan'!$C$8=\"Central\",VLOOKUP('Seeding Plan'!$B74,C_Dates,7,FALSE), IF('Seeding Plan'!$C$8=\"East_Central\",VLOOKUP('Seeding Plan'!$B74,EC_Dates,7,FALSE), IF('Seeding Plan'!$C$8=\"Southwest\",VLOOKUP('Seeding Plan'!$B74,SW_Dates,7,FALSE), IF('Seeding Plan'!$C$8=\"South_Central\",VLOOKUP('Seeding Plan'!$B74,SC_Dates,7,FALSE),IF('Seeding Plan'!$C$8=\"Southeast\",VLOOKUP('Seeding Plan'!$B74,SE_Dates,7,FALSE)))))))))))","v":""},{"$f":"IF('Seeding Plan'!$B74=\"\",\"\",IF('Seeding Plan'!$C$8=\"Northwest\",VLOOKUP('Seeding Plan'!$B74,NW_Dates,8,FALSE),IF('Seeding Plan'!$C$8=\"North_Central\",VLOOKUP('Seeding Plan'!$B74,NC_Dates,8,FALSE),IF('Seeding Plan'!$C$8=\"Northeast\",VLOOKUP('Seeding Plan'!$B74,NE_Dates,8,FALSE),IF('Seeding Plan'!$C$8=\"West_Central\",VLOOKUP('Seeding Plan'!$B74,WC_Dates,8,FALSE),IF('Seeding Plan'!$C$8=\"Central\",VLOOKUP('Seeding Plan'!$B74,C_Dates,8,FALSE), IF('Seeding Plan'!$C$8=\"East_Central\",VLOOKUP('Seeding Plan'!$B74,EC_Dates,8,FALSE), IF('Seeding Plan'!$C$8=\"Southwest\",VLOOKUP('Seeding Plan'!$B74,SW_Dates,8,FALSE), IF('Seeding Plan'!$C$8=\"South_Central\",VLOOKUP('Seeding Plan'!$B74,SC_Dates,8,FALSE),IF('Seeding Plan'!$C$8=\"Southeast\",VLOOKUP('Seeding Plan'!$B74,SE_Dates,8,FALSE)))))))))))","v":""},""]
["Sorghum-sudangrass","-","2021-05-12","2021-08-06","-","-","-","-","-",null,{"$f":"+'Seeding Plan'!B75","v":""},"",{"$f":"IF('Seeding Plan'!B75=\"\",\"\",IF('Seeding Plan'!$C$8=\"Northwest\",VLOOKUP('Seeding Plan'!$B75,NW_Dates,3,FALSE),IF('Seeding Plan'!$C$8=\"North_Central\",VLOOKUP('Seeding Plan'!$B75,NC_Dates,3,FALSE),IF('Seeding Plan'!$C$8=\"Northeast\",VLOOKUP('Seeding Plan'!$B75,NE_Dates,3,FALSE),IF('Seeding Plan'!$C$8=\"West_Central\",VLOOKUP('Seeding Plan'!$B75,WC_Dates,3,FALSE),IF('Seeding Plan'!$C$8=\"Central\",VLOOKUP('Seeding Plan'!$B75,C_Dates,3,FALSE), IF('Seeding Plan'!$C$8=\"East_Central\",VLOOKUP('Seeding Plan'!$B75,EC_Dates,3,FALSE), IF('Seeding Plan'!$C$8=\"Southwest\",VLOOKUP('Seeding Plan'!$B75,SW_Dates,3,FALSE), IF('Seeding Plan'!$C$8=\"South_Central\",VLOOKUP('Seeding Plan'!$B75,SC_Dates,3,FALSE),IF('Seeding Plan'!$C$8=\"Southeast\",VLOOKUP('Seeding Plan'!$B75,SE_Dates,3,FALSE)))))))))))","v":""},{"$f":"IF('Seeding Plan'!$B75=\"\",\"\",IF('Seeding Plan'!$C$8=\"Northwest\",VLOOKUP('Seeding Plan'!$B75,NW_Dates,4,FALSE),IF('Seeding Plan'!$C$8=\"North_Central\",VLOOKUP('Seeding Plan'!$B75,NC_Dates,4,FALSE),IF('Seeding Plan'!$C$8=\"Northeast\",VLOOKUP('Seeding Plan'!$B75,NE_Dates,4,FALSE),IF('Seeding Plan'!$C$8=\"West_Central\",VLOOKUP('Seeding Plan'!$B75,WC_Dates,4,FALSE),IF('Seeding Plan'!$C$8=\"Central\",VLOOKUP('Seeding Plan'!$B75,C_Dates,4,FALSE), IF('Seeding Plan'!$C$8=\"East_Central\",VLOOKUP('Seeding Plan'!$B75,EC_Dates,4,FALSE), IF('Seeding Plan'!$C$8=\"Southwest\",VLOOKUP('Seeding Plan'!$B75,SW_Dates,4,FALSE), IF('Seeding Plan'!$C$8=\"South_Central\",VLOOKUP('Seeding Plan'!$B75,SC_Dates,4,FALSE),IF('Seeding Plan'!$C$8=\"Southeast\",VLOOKUP('Seeding Plan'!$B75,SE_Dates,4,FALSE)))))))))))","v":""},"","",{"$f":"IF('Seeding Plan'!$B75=\"\",\"\",IF('Seeding Plan'!$C$8=\"Northwest\",VLOOKUP('Seeding Plan'!$B75,NW_Dates,7,FALSE),IF('Seeding Plan'!$C$8=\"North_Central\",VLOOKUP('Seeding Plan'!$B75,NC_Dates,7,FALSE),IF('Seeding Plan'!$C$8=\"Northeast\",VLOOKUP('Seeding Plan'!$B75,NE_Dates,7,FALSE),IF('Seeding Plan'!$C$8=\"West_Central\",VLOOKUP('Seeding Plan'!$B75,WC_Dates,7,FALSE),IF('Seeding Plan'!$C$8=\"Central\",VLOOKUP('Seeding Plan'!$B75,C_Dates,7,FALSE), IF('Seeding Plan'!$C$8=\"East_Central\",VLOOKUP('Seeding Plan'!$B75,EC_Dates,7,FALSE), IF('Seeding Plan'!$C$8=\"Southwest\",VLOOKUP('Seeding Plan'!$B75,SW_Dates,7,FALSE), IF('Seeding Plan'!$C$8=\"South_Central\",VLOOKUP('Seeding Plan'!$B75,SC_Dates,7,FALSE),IF('Seeding Plan'!$C$8=\"Southeast\",VLOOKUP('Seeding Plan'!$B75,SE_Dates,7,FALSE)))))))))))","v":""},{"$f":"IF('Seeding Plan'!$B75=\"\",\"\",IF('Seeding Plan'!$C$8=\"Northwest\",VLOOKUP('Seeding Plan'!$B75,NW_Dates,8,FALSE),IF('Seeding Plan'!$C$8=\"North_Central\",VLOOKUP('Seeding Plan'!$B75,NC_Dates,8,FALSE),IF('Seeding Plan'!$C$8=\"Northeast\",VLOOKUP('Seeding Plan'!$B75,NE_Dates,8,FALSE),IF('Seeding Plan'!$C$8=\"West_Central\",VLOOKUP('Seeding Plan'!$B75,WC_Dates,8,FALSE),IF('Seeding Plan'!$C$8=\"Central\",VLOOKUP('Seeding Plan'!$B75,C_Dates,8,FALSE), IF('Seeding Plan'!$C$8=\"East_Central\",VLOOKUP('Seeding Plan'!$B75,EC_Dates,8,FALSE), IF('Seeding Plan'!$C$8=\"Southwest\",VLOOKUP('Seeding Plan'!$B75,SW_Dates,8,FALSE), IF('Seeding Plan'!$C$8=\"South_Central\",VLOOKUP('Seeding Plan'!$B75,SC_Dates,8,FALSE),IF('Seeding Plan'!$C$8=\"Southeast\",VLOOKUP('Seeding Plan'!$B75,SE_Dates,8,FALSE)))))))))))","v":""},""]
["Sudangrass","-","2021-05-12","2021-08-06","-","-","-","-","-",null,{"$f":"+'Seeding Plan'!B76","v":""},"",{"$f":"IF('Seeding Plan'!B76=\"\",\"\",IF('Seeding Plan'!$C$8=\"Northwest\",VLOOKUP('Seeding Plan'!$B76,NW_Dates,3,FALSE),IF('Seeding Plan'!$C$8=\"North_Central\",VLOOKUP('Seeding Plan'!$B76,NC_Dates,3,FALSE),IF('Seeding Plan'!$C$8=\"Northeast\",VLOOKUP('Seeding Plan'!$B76,NE_Dates,3,FALSE),IF('Seeding Plan'!$C$8=\"West_Central\",VLOOKUP('Seeding Plan'!$B76,WC_Dates,3,FALSE),IF('Seeding Plan'!$C$8=\"Central\",VLOOKUP('Seeding Plan'!$B76,C_Dates,3,FALSE), IF('Seeding Plan'!$C$8=\"East_Central\",VLOOKUP('Seeding Plan'!$B76,EC_Dates,3,FALSE), IF('Seeding Plan'!$C$8=\"Southwest\",VLOOKUP('Seeding Plan'!$B76,SW_Dates,3,FALSE), IF('Seeding Plan'!$C$8=\"South_Central\",VLOOKUP('Seeding Plan'!$B76,SC_Dates,3,FALSE),IF('Seeding Plan'!$C$8=\"Southeast\",VLOOKUP('Seeding Plan'!$B76,SE_Dates,3,FALSE)))))))))))","v":""},{"$f":"IF('Seeding Plan'!$B76=\"\",\"\",IF('Seeding Plan'!$C$8=\"Northwest\",VLOOKUP('Seeding Plan'!$B76,NW_Dates,4,FALSE),IF('Seeding Plan'!$C$8=\"North_Central\",VLOOKUP('Seeding Plan'!$B76,NC_Dates,4,FALSE),IF('Seeding Plan'!$C$8=\"Northeast\",VLOOKUP('Seeding Plan'!$B76,NE_Dates,4,FALSE),IF('Seeding Plan'!$C$8=\"West_Central\",VLOOKUP('Seeding Plan'!$B76,WC_Dates,4,FALSE),IF('Seeding Plan'!$C$8=\"Central\",VLOOKUP('Seeding Plan'!$B76,C_Dates,4,FALSE), IF('Seeding Plan'!$C$8=\"East_Central\",VLOOKUP('Seeding Plan'!$B76,EC_Dates,4,FALSE), IF('Seeding Plan'!$C$8=\"Southwest\",VLOOKUP('Seeding Plan'!$B76,SW_Dates,4,FALSE), IF('Seeding Plan'!$C$8=\"South_Central\",VLOOKUP('Seeding Plan'!$B76,SC_Dates,4,FALSE),IF('Seeding Plan'!$C$8=\"Southeast\",VLOOKUP('Seeding Plan'!$B76,SE_Dates,4,FALSE)))))))))))","v":""},"","",{"$f":"IF('Seeding Plan'!$B76=\"\",\"\",IF('Seeding Plan'!$C$8=\"Northwest\",VLOOKUP('Seeding Plan'!$B76,NW_Dates,7,FALSE),IF('Seeding Plan'!$C$8=\"North_Central\",VLOOKUP('Seeding Plan'!$B76,NC_Dates,7,FALSE),IF('Seeding Plan'!$C$8=\"Northeast\",VLOOKUP('Seeding Plan'!$B76,NE_Dates,7,FALSE),IF('Seeding Plan'!$C$8=\"West_Central\",VLOOKUP('Seeding Plan'!$B76,WC_Dates,7,FALSE),IF('Seeding Plan'!$C$8=\"Central\",VLOOKUP('Seeding Plan'!$B76,C_Dates,7,FALSE), IF('Seeding Plan'!$C$8=\"East_Central\",VLOOKUP('Seeding Plan'!$B76,EC_Dates,7,FALSE), IF('Seeding Plan'!$C$8=\"Southwest\",VLOOKUP('Seeding Plan'!$B76,SW_Dates,7,FALSE), IF('Seeding Plan'!$C$8=\"South_Central\",VLOOKUP('Seeding Plan'!$B76,SC_Dates,7,FALSE),IF('Seeding Plan'!$C$8=\"Southeast\",VLOOKUP('Seeding Plan'!$B76,SE_Dates,7,FALSE)))))))))))","v":""},{"$f":"IF('Seeding Plan'!$B76=\"\",\"\",IF('Seeding Plan'!$C$8=\"Northwest\",VLOOKUP('Seeding Plan'!$B76,NW_Dates,8,FALSE),IF('Seeding Plan'!$C$8=\"North_Central\",VLOOKUP('Seeding Plan'!$B76,NC_Dates,8,FALSE),IF('Seeding Plan'!$C$8=\"Northeast\",VLOOKUP('Seeding Plan'!$B76,NE_Dates,8,FALSE),IF('Seeding Plan'!$C$8=\"West_Central\",VLOOKUP('Seeding Plan'!$B76,WC_Dates,8,FALSE),IF('Seeding Plan'!$C$8=\"Central\",VLOOKUP('Seeding Plan'!$B76,C_Dates,8,FALSE), IF('Seeding Plan'!$C$8=\"East_Central\",VLOOKUP('Seeding Plan'!$B76,EC_Dates,8,FALSE), IF('Seeding Plan'!$C$8=\"Southwest\",VLOOKUP('Seeding Plan'!$B76,SW_Dates,8,FALSE), IF('Seeding Plan'!$C$8=\"South_Central\",VLOOKUP('Seeding Plan'!$B76,SC_Dates,8,FALSE),IF('Seeding Plan'!$C$8=\"Southeast\",VLOOKUP('Seeding Plan'!$B76,SE_Dates,8,FALSE)))))))))))","v":""},""]
["Sunflower","-","2021-04-28","2021-08-06","2021-08-26","-","-","-","-",null,{"$f":"+'Seeding Plan'!B77","v":""},"",{"$f":"IF('Seeding Plan'!B77=\"\",\"\",IF('Seeding Plan'!$C$8=\"Northwest\",VLOOKUP('Seeding Plan'!$B77,NW_Dates,3,FALSE),IF('Seeding Plan'!$C$8=\"North_Central\",VLOOKUP('Seeding Plan'!$B77,NC_Dates,3,FALSE),IF('Seeding Plan'!$C$8=\"Northeast\",VLOOKUP('Seeding Plan'!$B77,NE_Dates,3,FALSE),IF('Seeding Plan'!$C$8=\"West_Central\",VLOOKUP('Seeding Plan'!$B77,WC_Dates,3,FALSE),IF('Seeding Plan'!$C$8=\"Central\",VLOOKUP('Seeding Plan'!$B77,C_Dates,3,FALSE), IF('Seeding Plan'!$C$8=\"East_Central\",VLOOKUP('Seeding Plan'!$B77,EC_Dates,3,FALSE), IF('Seeding Plan'!$C$8=\"Southwest\",VLOOKUP('Seeding Plan'!$B77,SW_Dates,3,FALSE), IF('Seeding Plan'!$C$8=\"South_Central\",VLOOKUP('Seeding Plan'!$B77,SC_Dates,3,FALSE),IF('Seeding Plan'!$C$8=\"Southeast\",VLOOKUP('Seeding Plan'!$B77,SE_Dates,3,FALSE)))))))))))","v":""},{"$f":"IF('Seeding Plan'!$B77=\"\",\"\",IF('Seeding Plan'!$C$8=\"Northwest\",VLOOKUP('Seeding Plan'!$B77,NW_Dates,4,FALSE),IF('Seeding Plan'!$C$8=\"North_Central\",VLOOKUP('Seeding Plan'!$B77,NC_Dates,4,FALSE),IF('Seeding Plan'!$C$8=\"Northeast\",VLOOKUP('Seeding Plan'!$B77,NE_Dates,4,FALSE),IF('Seeding Plan'!$C$8=\"West_Central\",VLOOKUP('Seeding Plan'!$B77,WC_Dates,4,FALSE),IF('Seeding Plan'!$C$8=\"Central\",VLOOKUP('Seeding Plan'!$B77,C_Dates,4,FALSE), IF('Seeding Plan'!$C$8=\"East_Central\",VLOOKUP('Seeding Plan'!$B77,EC_Dates,4,FALSE), IF('Seeding Plan'!$C$8=\"Southwest\",VLOOKUP('Seeding Plan'!$B77,SW_Dates,4,FALSE), IF('Seeding Plan'!$C$8=\"South_Central\",VLOOKUP('Seeding Plan'!$B77,SC_Dates,4,FALSE),IF('Seeding Plan'!$C$8=\"Southeast\",VLOOKUP('Seeding Plan'!$B77,SE_Dates,4,FALSE)))))))))))","v":""},"","",{"$f":"IF('Seeding Plan'!$B77=\"\",\"\",IF('Seeding Plan'!$C$8=\"Northwest\",VLOOKUP('Seeding Plan'!$B77,NW_Dates,7,FALSE),IF('Seeding Plan'!$C$8=\"North_Central\",VLOOKUP('Seeding Plan'!$B77,NC_Dates,7,FALSE),IF('Seeding Plan'!$C$8=\"Northeast\",VLOOKUP('Seeding Plan'!$B77,NE_Dates,7,FALSE),IF('Seeding Plan'!$C$8=\"West_Central\",VLOOKUP('Seeding Plan'!$B77,WC_Dates,7,FALSE),IF('Seeding Plan'!$C$8=\"Central\",VLOOKUP('Seeding Plan'!$B77,C_Dates,7,FALSE), IF('Seeding Plan'!$C$8=\"East_Central\",VLOOKUP('Seeding Plan'!$B77,EC_Dates,7,FALSE), IF('Seeding Plan'!$C$8=\"Southwest\",VLOOKUP('Seeding Plan'!$B77,SW_Dates,7,FALSE), IF('Seeding Plan'!$C$8=\"South_Central\",VLOOKUP('Seeding Plan'!$B77,SC_Dates,7,FALSE),IF('Seeding Plan'!$C$8=\"Southeast\",VLOOKUP('Seeding Plan'!$B77,SE_Dates,7,FALSE)))))))))))","v":""},{"$f":"IF('Seeding Plan'!$B77=\"\",\"\",IF('Seeding Plan'!$C$8=\"Northwest\",VLOOKUP('Seeding Plan'!$B77,NW_Dates,8,FALSE),IF('Seeding Plan'!$C$8=\"North_Central\",VLOOKUP('Seeding Plan'!$B77,NC_Dates,8,FALSE),IF('Seeding Plan'!$C$8=\"Northeast\",VLOOKUP('Seeding Plan'!$B77,NE_Dates,8,FALSE),IF('Seeding Plan'!$C$8=\"West_Central\",VLOOKUP('Seeding Plan'!$B77,WC_Dates,8,FALSE),IF('Seeding Plan'!$C$8=\"Central\",VLOOKUP('Seeding Plan'!$B77,C_Dates,8,FALSE), IF('Seeding Plan'!$C$8=\"East_Central\",VLOOKUP('Seeding Plan'!$B77,EC_Dates,8,FALSE), IF('Seeding Plan'!$C$8=\"Southwest\",VLOOKUP('Seeding Plan'!$B77,SW_Dates,8,FALSE), IF('Seeding Plan'!$C$8=\"South_Central\",VLOOKUP('Seeding Plan'!$B77,SC_Dates,8,FALSE),IF('Seeding Plan'!$C$8=\"Southeast\",VLOOKUP('Seeding Plan'!$B77,SE_Dates,8,FALSE)))))))))))","v":""},""]
["Sunn Hemp","-","2021-05-12","2021-08-06","2021-08-26","-","-","-","-",null,{"$f":"+'Seeding Plan'!B78","v":""},"",{"$f":"IF('Seeding Plan'!B78=\"\",\"\",IF('Seeding Plan'!$C$8=\"Northwest\",VLOOKUP('Seeding Plan'!$B78,NW_Dates,3,FALSE),IF('Seeding Plan'!$C$8=\"North_Central\",VLOOKUP('Seeding Plan'!$B78,NC_Dates,3,FALSE),IF('Seeding Plan'!$C$8=\"Northeast\",VLOOKUP('Seeding Plan'!$B78,NE_Dates,3,FALSE),IF('Seeding Plan'!$C$8=\"West_Central\",VLOOKUP('Seeding Plan'!$B78,WC_Dates,3,FALSE),IF('Seeding Plan'!$C$8=\"Central\",VLOOKUP('Seeding Plan'!$B78,C_Dates,3,FALSE), IF('Seeding Plan'!$C$8=\"East_Central\",VLOOKUP('Seeding Plan'!$B78,EC_Dates,3,FALSE), IF('Seeding Plan'!$C$8=\"Southwest\",VLOOKUP('Seeding Plan'!$B78,SW_Dates,3,FALSE), IF('Seeding Plan'!$C$8=\"South_Central\",VLOOKUP('Seeding Plan'!$B78,SC_Dates,3,FALSE),IF('Seeding Plan'!$C$8=\"Southeast\",VLOOKUP('Seeding Plan'!$B78,SE_Dates,3,FALSE)))))))))))","v":""},{"$f":"IF('Seeding Plan'!$B78=\"\",\"\",IF('Seeding Plan'!$C$8=\"Northwest\",VLOOKUP('Seeding Plan'!$B78,NW_Dates,4,FALSE),IF('Seeding Plan'!$C$8=\"North_Central\",VLOOKUP('Seeding Plan'!$B78,NC_Dates,4,FALSE),IF('Seeding Plan'!$C$8=\"Northeast\",VLOOKUP('Seeding Plan'!$B78,NE_Dates,4,FALSE),IF('Seeding Plan'!$C$8=\"West_Central\",VLOOKUP('Seeding Plan'!$B78,WC_Dates,4,FALSE),IF('Seeding Plan'!$C$8=\"Central\",VLOOKUP('Seeding Plan'!$B78,C_Dates,4,FALSE), IF('Seeding Plan'!$C$8=\"East_Central\",VLOOKUP('Seeding Plan'!$B78,EC_Dates,4,FALSE), IF('Seeding Plan'!$C$8=\"Southwest\",VLOOKUP('Seeding Plan'!$B78,SW_Dates,4,FALSE), IF('Seeding Plan'!$C$8=\"South_Central\",VLOOKUP('Seeding Plan'!$B78,SC_Dates,4,FALSE),IF('Seeding Plan'!$C$8=\"Southeast\",VLOOKUP('Seeding Plan'!$B78,SE_Dates,4,FALSE)))))))))))","v":""},"","",{"$f":"IF('Seeding Plan'!$B78=\"\",\"\",IF('Seeding Plan'!$C$8=\"Northwest\",VLOOKUP('Seeding Plan'!$B78,NW_Dates,7,FALSE),IF('Seeding Plan'!$C$8=\"North_Central\",VLOOKUP('Seeding Plan'!$B78,NC_Dates,7,FALSE),IF('Seeding Plan'!$C$8=\"Northeast\",VLOOKUP('Seeding Plan'!$B78,NE_Dates,7,FALSE),IF('Seeding Plan'!$C$8=\"West_Central\",VLOOKUP('Seeding Plan'!$B78,WC_Dates,7,FALSE),IF('Seeding Plan'!$C$8=\"Central\",VLOOKUP('Seeding Plan'!$B78,C_Dates,7,FALSE), IF('Seeding Plan'!$C$8=\"East_Central\",VLOOKUP('Seeding Plan'!$B78,EC_Dates,7,FALSE), IF('Seeding Plan'!$C$8=\"Southwest\",VLOOKUP('Seeding Plan'!$B78,SW_Dates,7,FALSE), IF('Seeding Plan'!$C$8=\"South_Central\",VLOOKUP('Seeding Plan'!$B78,SC_Dates,7,FALSE),IF('Seeding Plan'!$C$8=\"Southeast\",VLOOKUP('Seeding Plan'!$B78,SE_Dates,7,FALSE)))))))))))","v":""},{"$f":"IF('Seeding Plan'!$B78=\"\",\"\",IF('Seeding Plan'!$C$8=\"Northwest\",VLOOKUP('Seeding Plan'!$B78,NW_Dates,8,FALSE),IF('Seeding Plan'!$C$8=\"North_Central\",VLOOKUP('Seeding Plan'!$B78,NC_Dates,8,FALSE),IF('Seeding Plan'!$C$8=\"Northeast\",VLOOKUP('Seeding Plan'!$B78,NE_Dates,8,FALSE),IF('Seeding Plan'!$C$8=\"West_Central\",VLOOKUP('Seeding Plan'!$B78,WC_Dates,8,FALSE),IF('Seeding Plan'!$C$8=\"Central\",VLOOKUP('Seeding Plan'!$B78,C_Dates,8,FALSE), IF('Seeding Plan'!$C$8=\"East_Central\",VLOOKUP('Seeding Plan'!$B78,EC_Dates,8,FALSE), IF('Seeding Plan'!$C$8=\"Southwest\",VLOOKUP('Seeding Plan'!$B78,SW_Dates,8,FALSE), IF('Seeding Plan'!$C$8=\"South_Central\",VLOOKUP('Seeding Plan'!$B78,SC_Dates,8,FALSE),IF('Seeding Plan'!$C$8=\"Southeast\",VLOOKUP('Seeding Plan'!$B78,SE_Dates,8,FALSE)))))))))))","v":""},""]
["Teff","-","2021-05-12","2021-08-06","2021-08-26","-","-","-","-",null,{"$f":"+'Seeding Plan'!B79","v":""},"",{"$f":"IF('Seeding Plan'!B79=\"\",\"\",IF('Seeding Plan'!$C$8=\"Northwest\",VLOOKUP('Seeding Plan'!$B79,NW_Dates,3,FALSE),IF('Seeding Plan'!$C$8=\"North_Central\",VLOOKUP('Seeding Plan'!$B79,NC_Dates,3,FALSE),IF('Seeding Plan'!$C$8=\"Northeast\",VLOOKUP('Seeding Plan'!$B79,NE_Dates,3,FALSE),IF('Seeding Plan'!$C$8=\"West_Central\",VLOOKUP('Seeding Plan'!$B79,WC_Dates,3,FALSE),IF('Seeding Plan'!$C$8=\"Central\",VLOOKUP('Seeding Plan'!$B79,C_Dates,3,FALSE), IF('Seeding Plan'!$C$8=\"East_Central\",VLOOKUP('Seeding Plan'!$B79,EC_Dates,3,FALSE), IF('Seeding Plan'!$C$8=\"Southwest\",VLOOKUP('Seeding Plan'!$B79,SW_Dates,3,FALSE), IF('Seeding Plan'!$C$8=\"South_Central\",VLOOKUP('Seeding Plan'!$B79,SC_Dates,3,FALSE),IF('Seeding Plan'!$C$8=\"Southeast\",VLOOKUP('Seeding Plan'!$B79,SE_Dates,3,FALSE)))))))))))","v":""},{"$f":"IF('Seeding Plan'!$B79=\"\",\"\",IF('Seeding Plan'!$C$8=\"Northwest\",VLOOKUP('Seeding Plan'!$B79,NW_Dates,4,FALSE),IF('Seeding Plan'!$C$8=\"North_Central\",VLOOKUP('Seeding Plan'!$B79,NC_Dates,4,FALSE),IF('Seeding Plan'!$C$8=\"Northeast\",VLOOKUP('Seeding Plan'!$B79,NE_Dates,4,FALSE),IF('Seeding Plan'!$C$8=\"West_Central\",VLOOKUP('Seeding Plan'!$B79,WC_Dates,4,FALSE),IF('Seeding Plan'!$C$8=\"Central\",VLOOKUP('Seeding Plan'!$B79,C_Dates,4,FALSE), IF('Seeding Plan'!$C$8=\"East_Central\",VLOOKUP('Seeding Plan'!$B79,EC_Dates,4,FALSE), IF('Seeding Plan'!$C$8=\"Southwest\",VLOOKUP('Seeding Plan'!$B79,SW_Dates,4,FALSE), IF('Seeding Plan'!$C$8=\"South_Central\",VLOOKUP('Seeding Plan'!$B79,SC_Dates,4,FALSE),IF('Seeding Plan'!$C$8=\"Southeast\",VLOOKUP('Seeding Plan'!$B79,SE_Dates,4,FALSE)))))))))))","v":""},"","",{"$f":"IF('Seeding Plan'!$B79=\"\",\"\",IF('Seeding Plan'!$C$8=\"Northwest\",VLOOKUP('Seeding Plan'!$B79,NW_Dates,7,FALSE),IF('Seeding Plan'!$C$8=\"North_Central\",VLOOKUP('Seeding Plan'!$B79,NC_Dates,7,FALSE),IF('Seeding Plan'!$C$8=\"Northeast\",VLOOKUP('Seeding Plan'!$B79,NE_Dates,7,FALSE),IF('Seeding Plan'!$C$8=\"West_Central\",VLOOKUP('Seeding Plan'!$B79,WC_Dates,7,FALSE),IF('Seeding Plan'!$C$8=\"Central\",VLOOKUP('Seeding Plan'!$B79,C_Dates,7,FALSE), IF('Seeding Plan'!$C$8=\"East_Central\",VLOOKUP('Seeding Plan'!$B79,EC_Dates,7,FALSE), IF('Seeding Plan'!$C$8=\"Southwest\",VLOOKUP('Seeding Plan'!$B79,SW_Dates,7,FALSE), IF('Seeding Plan'!$C$8=\"South_Central\",VLOOKUP('Seeding Plan'!$B79,SC_Dates,7,FALSE),IF('Seeding Plan'!$C$8=\"Southeast\",VLOOKUP('Seeding Plan'!$B79,SE_Dates,7,FALSE)))))))))))","v":""},{"$f":"IF('Seeding Plan'!$B79=\"\",\"\",IF('Seeding Plan'!$C$8=\"Northwest\",VLOOKUP('Seeding Plan'!$B79,NW_Dates,8,FALSE),IF('Seeding Plan'!$C$8=\"North_Central\",VLOOKUP('Seeding Plan'!$B79,NC_Dates,8,FALSE),IF('Seeding Plan'!$C$8=\"Northeast\",VLOOKUP('Seeding Plan'!$B79,NE_Dates,8,FALSE),IF('Seeding Plan'!$C$8=\"West_Central\",VLOOKUP('Seeding Plan'!$B79,WC_Dates,8,FALSE),IF('Seeding Plan'!$C$8=\"Central\",VLOOKUP('Seeding Plan'!$B79,C_Dates,8,FALSE), IF('Seeding Plan'!$C$8=\"East_Central\",VLOOKUP('Seeding Plan'!$B79,EC_Dates,8,FALSE), IF('Seeding Plan'!$C$8=\"Southwest\",VLOOKUP('Seeding Plan'!$B79,SW_Dates,8,FALSE), IF('Seeding Plan'!$C$8=\"South_Central\",VLOOKUP('Seeding Plan'!$B79,SC_Dates,8,FALSE),IF('Seeding Plan'!$C$8=\"Southeast\",VLOOKUP('Seeding Plan'!$B79,SE_Dates,8,FALSE)))))))))))","v":""},""]
["Triticale, Winter","-","-","-","-","2021-08-06","2021-08-20","2021-10-22","2021-11-03",null,{"$f":"+'Seeding Plan'!B80","v":""},"",{"$f":"IF('Seeding Plan'!B80=\"\",\"\",IF('Seeding Plan'!$C$8=\"Northwest\",VLOOKUP('Seeding Plan'!$B80,NW_Dates,3,FALSE),IF('Seeding Plan'!$C$8=\"North_Central\",VLOOKUP('Seeding Plan'!$B80,NC_Dates,3,FALSE),IF('Seeding Plan'!$C$8=\"Northeast\",VLOOKUP('Seeding Plan'!$B80,NE_Dates,3,FALSE),IF('Seeding Plan'!$C$8=\"West_Central\",VLOOKUP('Seeding Plan'!$B80,WC_Dates,3,FALSE),IF('Seeding Plan'!$C$8=\"Central\",VLOOKUP('Seeding Plan'!$B80,C_Dates,3,FALSE), IF('Seeding Plan'!$C$8=\"East_Central\",VLOOKUP('Seeding Plan'!$B80,EC_Dates,3,FALSE), IF('Seeding Plan'!$C$8=\"Southwest\",VLOOKUP('Seeding Plan'!$B80,SW_Dates,3,FALSE), IF('Seeding Plan'!$C$8=\"South_Central\",VLOOKUP('Seeding Plan'!$B80,SC_Dates,3,FALSE),IF('Seeding Plan'!$C$8=\"Southeast\",VLOOKUP('Seeding Plan'!$B80,SE_Dates,3,FALSE)))))))))))","v":""},{"$f":"IF('Seeding Plan'!$B80=\"\",\"\",IF('Seeding Plan'!$C$8=\"Northwest\",VLOOKUP('Seeding Plan'!$B80,NW_Dates,4,FALSE),IF('Seeding Plan'!$C$8=\"North_Central\",VLOOKUP('Seeding Plan'!$B80,NC_Dates,4,FALSE),IF('Seeding Plan'!$C$8=\"Northeast\",VLOOKUP('Seeding Plan'!$B80,NE_Dates,4,FALSE),IF('Seeding Plan'!$C$8=\"West_Central\",VLOOKUP('Seeding Plan'!$B80,WC_Dates,4,FALSE),IF('Seeding Plan'!$C$8=\"Central\",VLOOKUP('Seeding Plan'!$B80,C_Dates,4,FALSE), IF('Seeding Plan'!$C$8=\"East_Central\",VLOOKUP('Seeding Plan'!$B80,EC_Dates,4,FALSE), IF('Seeding Plan'!$C$8=\"Southwest\",VLOOKUP('Seeding Plan'!$B80,SW_Dates,4,FALSE), IF('Seeding Plan'!$C$8=\"South_Central\",VLOOKUP('Seeding Plan'!$B80,SC_Dates,4,FALSE),IF('Seeding Plan'!$C$8=\"Southeast\",VLOOKUP('Seeding Plan'!$B80,SE_Dates,4,FALSE)))))))))))","v":""},"","",{"$f":"IF('Seeding Plan'!$B80=\"\",\"\",IF('Seeding Plan'!$C$8=\"Northwest\",VLOOKUP('Seeding Plan'!$B80,NW_Dates,7,FALSE),IF('Seeding Plan'!$C$8=\"North_Central\",VLOOKUP('Seeding Plan'!$B80,NC_Dates,7,FALSE),IF('Seeding Plan'!$C$8=\"Northeast\",VLOOKUP('Seeding Plan'!$B80,NE_Dates,7,FALSE),IF('Seeding Plan'!$C$8=\"West_Central\",VLOOKUP('Seeding Plan'!$B80,WC_Dates,7,FALSE),IF('Seeding Plan'!$C$8=\"Central\",VLOOKUP('Seeding Plan'!$B80,C_Dates,7,FALSE), IF('Seeding Plan'!$C$8=\"East_Central\",VLOOKUP('Seeding Plan'!$B80,EC_Dates,7,FALSE), IF('Seeding Plan'!$C$8=\"Southwest\",VLOOKUP('Seeding Plan'!$B80,SW_Dates,7,FALSE), IF('Seeding Plan'!$C$8=\"South_Central\",VLOOKUP('Seeding Plan'!$B80,SC_Dates,7,FALSE),IF('Seeding Plan'!$C$8=\"Southeast\",VLOOKUP('Seeding Plan'!$B80,SE_Dates,7,FALSE)))))))))))","v":""},{"$f":"IF('Seeding Plan'!$B80=\"\",\"\",IF('Seeding Plan'!$C$8=\"Northwest\",VLOOKUP('Seeding Plan'!$B80,NW_Dates,8,FALSE),IF('Seeding Plan'!$C$8=\"North_Central\",VLOOKUP('Seeding Plan'!$B80,NC_Dates,8,FALSE),IF('Seeding Plan'!$C$8=\"Northeast\",VLOOKUP('Seeding Plan'!$B80,NE_Dates,8,FALSE),IF('Seeding Plan'!$C$8=\"West_Central\",VLOOKUP('Seeding Plan'!$B80,WC_Dates,8,FALSE),IF('Seeding Plan'!$C$8=\"Central\",VLOOKUP('Seeding Plan'!$B80,C_Dates,8,FALSE), IF('Seeding Plan'!$C$8=\"East_Central\",VLOOKUP('Seeding Plan'!$B80,EC_Dates,8,FALSE), IF('Seeding Plan'!$C$8=\"Southwest\",VLOOKUP('Seeding Plan'!$B80,SW_Dates,8,FALSE), IF('Seeding Plan'!$C$8=\"South_Central\",VLOOKUP('Seeding Plan'!$B80,SC_Dates,8,FALSE),IF('Seeding Plan'!$C$8=\"Southeast\",VLOOKUP('Seeding Plan'!$B80,SE_Dates,8,FALSE)))))))))))","v":""},""]
["Turnip","2021-04-01","--","--",{"$f":"I148","v":"2021-09-22"},{"$f":"B148","v":"2021-04-01"},"2021-08-06","2021-09-09","2021-09-22",null,{"$f":"+'Seeding Plan'!B81","v":""},"",{"$f":"IF('Seeding Plan'!B81=\"\",\"\",IF('Seeding Plan'!$C$8=\"Northwest\",VLOOKUP('Seeding Plan'!$B81,NW_Dates,3,FALSE),IF('Seeding Plan'!$C$8=\"North_Central\",VLOOKUP('Seeding Plan'!$B81,NC_Dates,3,FALSE),IF('Seeding Plan'!$C$8=\"Northeast\",VLOOKUP('Seeding Plan'!$B81,NE_Dates,3,FALSE),IF('Seeding Plan'!$C$8=\"West_Central\",VLOOKUP('Seeding Plan'!$B81,WC_Dates,3,FALSE),IF('Seeding Plan'!$C$8=\"Central\",VLOOKUP('Seeding Plan'!$B81,C_Dates,3,FALSE), IF('Seeding Plan'!$C$8=\"East_Central\",VLOOKUP('Seeding Plan'!$B81,EC_Dates,3,FALSE), IF('Seeding Plan'!$C$8=\"Southwest\",VLOOKUP('Seeding Plan'!$B81,SW_Dates,3,FALSE), IF('Seeding Plan'!$C$8=\"South_Central\",VLOOKUP('Seeding Plan'!$B81,SC_Dates,3,FALSE),IF('Seeding Plan'!$C$8=\"Southeast\",VLOOKUP('Seeding Plan'!$B81,SE_Dates,3,FALSE)))))))))))","v":""},{"$f":"IF('Seeding Plan'!$B81=\"\",\"\",IF('Seeding Plan'!$C$8=\"Northwest\",VLOOKUP('Seeding Plan'!$B81,NW_Dates,4,FALSE),IF('Seeding Plan'!$C$8=\"North_Central\",VLOOKUP('Seeding Plan'!$B81,NC_Dates,4,FALSE),IF('Seeding Plan'!$C$8=\"Northeast\",VLOOKUP('Seeding Plan'!$B81,NE_Dates,4,FALSE),IF('Seeding Plan'!$C$8=\"West_Central\",VLOOKUP('Seeding Plan'!$B81,WC_Dates,4,FALSE),IF('Seeding Plan'!$C$8=\"Central\",VLOOKUP('Seeding Plan'!$B81,C_Dates,4,FALSE), IF('Seeding Plan'!$C$8=\"East_Central\",VLOOKUP('Seeding Plan'!$B81,EC_Dates,4,FALSE), IF('Seeding Plan'!$C$8=\"Southwest\",VLOOKUP('Seeding Plan'!$B81,SW_Dates,4,FALSE), IF('Seeding Plan'!$C$8=\"South_Central\",VLOOKUP('Seeding Plan'!$B81,SC_Dates,4,FALSE),IF('Seeding Plan'!$C$8=\"Southeast\",VLOOKUP('Seeding Plan'!$B81,SE_Dates,4,FALSE)))))))))))","v":""},"","",{"$f":"IF('Seeding Plan'!$B81=\"\",\"\",IF('Seeding Plan'!$C$8=\"Northwest\",VLOOKUP('Seeding Plan'!$B81,NW_Dates,7,FALSE),IF('Seeding Plan'!$C$8=\"North_Central\",VLOOKUP('Seeding Plan'!$B81,NC_Dates,7,FALSE),IF('Seeding Plan'!$C$8=\"Northeast\",VLOOKUP('Seeding Plan'!$B81,NE_Dates,7,FALSE),IF('Seeding Plan'!$C$8=\"West_Central\",VLOOKUP('Seeding Plan'!$B81,WC_Dates,7,FALSE),IF('Seeding Plan'!$C$8=\"Central\",VLOOKUP('Seeding Plan'!$B81,C_Dates,7,FALSE), IF('Seeding Plan'!$C$8=\"East_Central\",VLOOKUP('Seeding Plan'!$B81,EC_Dates,7,FALSE), IF('Seeding Plan'!$C$8=\"Southwest\",VLOOKUP('Seeding Plan'!$B81,SW_Dates,7,FALSE), IF('Seeding Plan'!$C$8=\"South_Central\",VLOOKUP('Seeding Plan'!$B81,SC_Dates,7,FALSE),IF('Seeding Plan'!$C$8=\"Southeast\",VLOOKUP('Seeding Plan'!$B81,SE_Dates,7,FALSE)))))))))))","v":""},{"$f":"IF('Seeding Plan'!$B81=\"\",\"\",IF('Seeding Plan'!$C$8=\"Northwest\",VLOOKUP('Seeding Plan'!$B81,NW_Dates,8,FALSE),IF('Seeding Plan'!$C$8=\"North_Central\",VLOOKUP('Seeding Plan'!$B81,NC_Dates,8,FALSE),IF('Seeding Plan'!$C$8=\"Northeast\",VLOOKUP('Seeding Plan'!$B81,NE_Dates,8,FALSE),IF('Seeding Plan'!$C$8=\"West_Central\",VLOOKUP('Seeding Plan'!$B81,WC_Dates,8,FALSE),IF('Seeding Plan'!$C$8=\"Central\",VLOOKUP('Seeding Plan'!$B81,C_Dates,8,FALSE), IF('Seeding Plan'!$C$8=\"East_Central\",VLOOKUP('Seeding Plan'!$B81,EC_Dates,8,FALSE), IF('Seeding Plan'!$C$8=\"Southwest\",VLOOKUP('Seeding Plan'!$B81,SW_Dates,8,FALSE), IF('Seeding Plan'!$C$8=\"South_Central\",VLOOKUP('Seeding Plan'!$B81,SC_Dates,8,FALSE),IF('Seeding Plan'!$C$8=\"Southeast\",VLOOKUP('Seeding Plan'!$B81,SE_Dates,8,FALSE)))))))))))","v":""},""]
["Vetch, Common","-","2021-04-01","2021-05-18","-","-","2021-07-24","2021-08-26","2021-09-09",null,{"$f":"+'Seeding Plan'!B82","v":""},"",{"$f":"IF('Seeding Plan'!B82=\"\",\"\",IF('Seeding Plan'!$C$8=\"Northwest\",VLOOKUP('Seeding Plan'!$B82,NW_Dates,3,FALSE),IF('Seeding Plan'!$C$8=\"North_Central\",VLOOKUP('Seeding Plan'!$B82,NC_Dates,3,FALSE),IF('Seeding Plan'!$C$8=\"Northeast\",VLOOKUP('Seeding Plan'!$B82,NE_Dates,3,FALSE),IF('Seeding Plan'!$C$8=\"West_Central\",VLOOKUP('Seeding Plan'!$B82,WC_Dates,3,FALSE),IF('Seeding Plan'!$C$8=\"Central\",VLOOKUP('Seeding Plan'!$B82,C_Dates,3,FALSE), IF('Seeding Plan'!$C$8=\"East_Central\",VLOOKUP('Seeding Plan'!$B82,EC_Dates,3,FALSE), IF('Seeding Plan'!$C$8=\"Southwest\",VLOOKUP('Seeding Plan'!$B82,SW_Dates,3,FALSE), IF('Seeding Plan'!$C$8=\"South_Central\",VLOOKUP('Seeding Plan'!$B82,SC_Dates,3,FALSE),IF('Seeding Plan'!$C$8=\"Southeast\",VLOOKUP('Seeding Plan'!$B82,SE_Dates,3,FALSE)))))))))))","v":""},{"$f":"IF('Seeding Plan'!$B82=\"\",\"\",IF('Seeding Plan'!$C$8=\"Northwest\",VLOOKUP('Seeding Plan'!$B82,NW_Dates,4,FALSE),IF('Seeding Plan'!$C$8=\"North_Central\",VLOOKUP('Seeding Plan'!$B82,NC_Dates,4,FALSE),IF('Seeding Plan'!$C$8=\"Northeast\",VLOOKUP('Seeding Plan'!$B82,NE_Dates,4,FALSE),IF('Seeding Plan'!$C$8=\"West_Central\",VLOOKUP('Seeding Plan'!$B82,WC_Dates,4,FALSE),IF('Seeding Plan'!$C$8=\"Central\",VLOOKUP('Seeding Plan'!$B82,C_Dates,4,FALSE), IF('Seeding Plan'!$C$8=\"East_Central\",VLOOKUP('Seeding Plan'!$B82,EC_Dates,4,FALSE), IF('Seeding Plan'!$C$8=\"Southwest\",VLOOKUP('Seeding Plan'!$B82,SW_Dates,4,FALSE), IF('Seeding Plan'!$C$8=\"South_Central\",VLOOKUP('Seeding Plan'!$B82,SC_Dates,4,FALSE),IF('Seeding Plan'!$C$8=\"Southeast\",VLOOKUP('Seeding Plan'!$B82,SE_Dates,4,FALSE)))))))))))","v":""},"","",{"$f":"IF('Seeding Plan'!$B82=\"\",\"\",IF('Seeding Plan'!$C$8=\"Northwest\",VLOOKUP('Seeding Plan'!$B82,NW_Dates,7,FALSE),IF('Seeding Plan'!$C$8=\"North_Central\",VLOOKUP('Seeding Plan'!$B82,NC_Dates,7,FALSE),IF('Seeding Plan'!$C$8=\"Northeast\",VLOOKUP('Seeding Plan'!$B82,NE_Dates,7,FALSE),IF('Seeding Plan'!$C$8=\"West_Central\",VLOOKUP('Seeding Plan'!$B82,WC_Dates,7,FALSE),IF('Seeding Plan'!$C$8=\"Central\",VLOOKUP('Seeding Plan'!$B82,C_Dates,7,FALSE), IF('Seeding Plan'!$C$8=\"East_Central\",VLOOKUP('Seeding Plan'!$B82,EC_Dates,7,FALSE), IF('Seeding Plan'!$C$8=\"Southwest\",VLOOKUP('Seeding Plan'!$B82,SW_Dates,7,FALSE), IF('Seeding Plan'!$C$8=\"South_Central\",VLOOKUP('Seeding Plan'!$B82,SC_Dates,7,FALSE),IF('Seeding Plan'!$C$8=\"Southeast\",VLOOKUP('Seeding Plan'!$B82,SE_Dates,7,FALSE)))))))))))","v":""},{"$f":"IF('Seeding Plan'!$B82=\"\",\"\",IF('Seeding Plan'!$C$8=\"Northwest\",VLOOKUP('Seeding Plan'!$B82,NW_Dates,8,FALSE),IF('Seeding Plan'!$C$8=\"North_Central\",VLOOKUP('Seeding Plan'!$B82,NC_Dates,8,FALSE),IF('Seeding Plan'!$C$8=\"Northeast\",VLOOKUP('Seeding Plan'!$B82,NE_Dates,8,FALSE),IF('Seeding Plan'!$C$8=\"West_Central\",VLOOKUP('Seeding Plan'!$B82,WC_Dates,8,FALSE),IF('Seeding Plan'!$C$8=\"Central\",VLOOKUP('Seeding Plan'!$B82,C_Dates,8,FALSE), IF('Seeding Plan'!$C$8=\"East_Central\",VLOOKUP('Seeding Plan'!$B82,EC_Dates,8,FALSE), IF('Seeding Plan'!$C$8=\"Southwest\",VLOOKUP('Seeding Plan'!$B82,SW_Dates,8,FALSE), IF('Seeding Plan'!$C$8=\"South_Central\",VLOOKUP('Seeding Plan'!$B82,SC_Dates,8,FALSE),IF('Seeding Plan'!$C$8=\"Southeast\",VLOOKUP('Seeding Plan'!$B82,SE_Dates,8,FALSE)))))))))))","v":""},""]
["Vetch, Hairy","-","2021-04-01","2021-06-01","-","-","2021-08-06","2021-09-09","2021-09-16",null,{"$f":"+'Seeding Plan'!B83","v":""},"",{"$f":"IF('Seeding Plan'!B83=\"\",\"\",IF('Seeding Plan'!$C$8=\"Northwest\",VLOOKUP('Seeding Plan'!$B83,NW_Dates,3,FALSE),IF('Seeding Plan'!$C$8=\"North_Central\",VLOOKUP('Seeding Plan'!$B83,NC_Dates,3,FALSE),IF('Seeding Plan'!$C$8=\"Northeast\",VLOOKUP('Seeding Plan'!$B83,NE_Dates,3,FALSE),IF('Seeding Plan'!$C$8=\"West_Central\",VLOOKUP('Seeding Plan'!$B83,WC_Dates,3,FALSE),IF('Seeding Plan'!$C$8=\"Central\",VLOOKUP('Seeding Plan'!$B83,C_Dates,3,FALSE), IF('Seeding Plan'!$C$8=\"East_Central\",VLOOKUP('Seeding Plan'!$B83,EC_Dates,3,FALSE), IF('Seeding Plan'!$C$8=\"Southwest\",VLOOKUP('Seeding Plan'!$B83,SW_Dates,3,FALSE), IF('Seeding Plan'!$C$8=\"South_Central\",VLOOKUP('Seeding Plan'!$B83,SC_Dates,3,FALSE),IF('Seeding Plan'!$C$8=\"Southeast\",VLOOKUP('Seeding Plan'!$B83,SE_Dates,3,FALSE)))))))))))","v":""},{"$f":"IF('Seeding Plan'!$B83=\"\",\"\",IF('Seeding Plan'!$C$8=\"Northwest\",VLOOKUP('Seeding Plan'!$B83,NW_Dates,4,FALSE),IF('Seeding Plan'!$C$8=\"North_Central\",VLOOKUP('Seeding Plan'!$B83,NC_Dates,4,FALSE),IF('Seeding Plan'!$C$8=\"Northeast\",VLOOKUP('Seeding Plan'!$B83,NE_Dates,4,FALSE),IF('Seeding Plan'!$C$8=\"West_Central\",VLOOKUP('Seeding Plan'!$B83,WC_Dates,4,FALSE),IF('Seeding Plan'!$C$8=\"Central\",VLOOKUP('Seeding Plan'!$B83,C_Dates,4,FALSE), IF('Seeding Plan'!$C$8=\"East_Central\",VLOOKUP('Seeding Plan'!$B83,EC_Dates,4,FALSE), IF('Seeding Plan'!$C$8=\"Southwest\",VLOOKUP('Seeding Plan'!$B83,SW_Dates,4,FALSE), IF('Seeding Plan'!$C$8=\"South_Central\",VLOOKUP('Seeding Plan'!$B83,SC_Dates,4,FALSE),IF('Seeding Plan'!$C$8=\"Southeast\",VLOOKUP('Seeding Plan'!$B83,SE_Dates,4,FALSE)))))))))))","v":""},"","",{"$f":"IF('Seeding Plan'!$B83=\"\",\"\",IF('Seeding Plan'!$C$8=\"Northwest\",VLOOKUP('Seeding Plan'!$B83,NW_Dates,7,FALSE),IF('Seeding Plan'!$C$8=\"North_Central\",VLOOKUP('Seeding Plan'!$B83,NC_Dates,7,FALSE),IF('Seeding Plan'!$C$8=\"Northeast\",VLOOKUP('Seeding Plan'!$B83,NE_Dates,7,FALSE),IF('Seeding Plan'!$C$8=\"West_Central\",VLOOKUP('Seeding Plan'!$B83,WC_Dates,7,FALSE),IF('Seeding Plan'!$C$8=\"Central\",VLOOKUP('Seeding Plan'!$B83,C_Dates,7,FALSE), IF('Seeding Plan'!$C$8=\"East_Central\",VLOOKUP('Seeding Plan'!$B83,EC_Dates,7,FALSE), IF('Seeding Plan'!$C$8=\"Southwest\",VLOOKUP('Seeding Plan'!$B83,SW_Dates,7,FALSE), IF('Seeding Plan'!$C$8=\"South_Central\",VLOOKUP('Seeding Plan'!$B83,SC_Dates,7,FALSE),IF('Seeding Plan'!$C$8=\"Southeast\",VLOOKUP('Seeding Plan'!$B83,SE_Dates,7,FALSE)))))))))))","v":""},{"$f":"IF('Seeding Plan'!$B83=\"\",\"\",IF('Seeding Plan'!$C$8=\"Northwest\",VLOOKUP('Seeding Plan'!$B83,NW_Dates,8,FALSE),IF('Seeding Plan'!$C$8=\"North_Central\",VLOOKUP('Seeding Plan'!$B83,NC_Dates,8,FALSE),IF('Seeding Plan'!$C$8=\"Northeast\",VLOOKUP('Seeding Plan'!$B83,NE_Dates,8,FALSE),IF('Seeding Plan'!$C$8=\"West_Central\",VLOOKUP('Seeding Plan'!$B83,WC_Dates,8,FALSE),IF('Seeding Plan'!$C$8=\"Central\",VLOOKUP('Seeding Plan'!$B83,C_Dates,8,FALSE), IF('Seeding Plan'!$C$8=\"East_Central\",VLOOKUP('Seeding Plan'!$B83,EC_Dates,8,FALSE), IF('Seeding Plan'!$C$8=\"Southwest\",VLOOKUP('Seeding Plan'!$B83,SW_Dates,8,FALSE), IF('Seeding Plan'!$C$8=\"South_Central\",VLOOKUP('Seeding Plan'!$B83,SC_Dates,8,FALSE),IF('Seeding Plan'!$C$8=\"Southeast\",VLOOKUP('Seeding Plan'!$B83,SE_Dates,8,FALSE)))))))))))","v":""},""]
["Wheat, Spring","2021-03-18","2021-04-01","2021-04-28","2021-05-25","2021-08-06","2021-08-20","2021-09-09","2021-09-22",null,{"$f":"+'Seeding Plan'!B84","v":""},"",{"$f":"IF('Seeding Plan'!B84=\"\",\"\",IF('Seeding Plan'!$C$8=\"Northwest\",VLOOKUP('Seeding Plan'!$B84,NW_Dates,3,FALSE),IF('Seeding Plan'!$C$8=\"North_Central\",VLOOKUP('Seeding Plan'!$B84,NC_Dates,3,FALSE),IF('Seeding Plan'!$C$8=\"Northeast\",VLOOKUP('Seeding Plan'!$B84,NE_Dates,3,FALSE),IF('Seeding Plan'!$C$8=\"West_Central\",VLOOKUP('Seeding Plan'!$B84,WC_Dates,3,FALSE),IF('Seeding Plan'!$C$8=\"Central\",VLOOKUP('Seeding Plan'!$B84,C_Dates,3,FALSE), IF('Seeding Plan'!$C$8=\"East_Central\",VLOOKUP('Seeding Plan'!$B84,EC_Dates,3,FALSE), IF('Seeding Plan'!$C$8=\"Southwest\",VLOOKUP('Seeding Plan'!$B84,SW_Dates,3,FALSE), IF('Seeding Plan'!$C$8=\"South_Central\",VLOOKUP('Seeding Plan'!$B84,SC_Dates,3,FALSE),IF('Seeding Plan'!$C$8=\"Southeast\",VLOOKUP('Seeding Plan'!$B84,SE_Dates,3,FALSE)))))))))))","v":""},{"$f":"IF('Seeding Plan'!$B84=\"\",\"\",IF('Seeding Plan'!$C$8=\"Northwest\",VLOOKUP('Seeding Plan'!$B84,NW_Dates,4,FALSE),IF('Seeding Plan'!$C$8=\"North_Central\",VLOOKUP('Seeding Plan'!$B84,NC_Dates,4,FALSE),IF('Seeding Plan'!$C$8=\"Northeast\",VLOOKUP('Seeding Plan'!$B84,NE_Dates,4,FALSE),IF('Seeding Plan'!$C$8=\"West_Central\",VLOOKUP('Seeding Plan'!$B84,WC_Dates,4,FALSE),IF('Seeding Plan'!$C$8=\"Central\",VLOOKUP('Seeding Plan'!$B84,C_Dates,4,FALSE), IF('Seeding Plan'!$C$8=\"East_Central\",VLOOKUP('Seeding Plan'!$B84,EC_Dates,4,FALSE), IF('Seeding Plan'!$C$8=\"Southwest\",VLOOKUP('Seeding Plan'!$B84,SW_Dates,4,FALSE), IF('Seeding Plan'!$C$8=\"South_Central\",VLOOKUP('Seeding Plan'!$B84,SC_Dates,4,FALSE),IF('Seeding Plan'!$C$8=\"Southeast\",VLOOKUP('Seeding Plan'!$B84,SE_Dates,4,FALSE)))))))))))","v":""},"","",{"$f":"IF('Seeding Plan'!$B84=\"\",\"\",IF('Seeding Plan'!$C$8=\"Northwest\",VLOOKUP('Seeding Plan'!$B84,NW_Dates,7,FALSE),IF('Seeding Plan'!$C$8=\"North_Central\",VLOOKUP('Seeding Plan'!$B84,NC_Dates,7,FALSE),IF('Seeding Plan'!$C$8=\"Northeast\",VLOOKUP('Seeding Plan'!$B84,NE_Dates,7,FALSE),IF('Seeding Plan'!$C$8=\"West_Central\",VLOOKUP('Seeding Plan'!$B84,WC_Dates,7,FALSE),IF('Seeding Plan'!$C$8=\"Central\",VLOOKUP('Seeding Plan'!$B84,C_Dates,7,FALSE), IF('Seeding Plan'!$C$8=\"East_Central\",VLOOKUP('Seeding Plan'!$B84,EC_Dates,7,FALSE), IF('Seeding Plan'!$C$8=\"Southwest\",VLOOKUP('Seeding Plan'!$B84,SW_Dates,7,FALSE), IF('Seeding Plan'!$C$8=\"South_Central\",VLOOKUP('Seeding Plan'!$B84,SC_Dates,7,FALSE),IF('Seeding Plan'!$C$8=\"Southeast\",VLOOKUP('Seeding Plan'!$B84,SE_Dates,7,FALSE)))))))))))","v":""},{"$f":"IF('Seeding Plan'!$B84=\"\",\"\",IF('Seeding Plan'!$C$8=\"Northwest\",VLOOKUP('Seeding Plan'!$B84,NW_Dates,8,FALSE),IF('Seeding Plan'!$C$8=\"North_Central\",VLOOKUP('Seeding Plan'!$B84,NC_Dates,8,FALSE),IF('Seeding Plan'!$C$8=\"Northeast\",VLOOKUP('Seeding Plan'!$B84,NE_Dates,8,FALSE),IF('Seeding Plan'!$C$8=\"West_Central\",VLOOKUP('Seeding Plan'!$B84,WC_Dates,8,FALSE),IF('Seeding Plan'!$C$8=\"Central\",VLOOKUP('Seeding Plan'!$B84,C_Dates,8,FALSE), IF('Seeding Plan'!$C$8=\"East_Central\",VLOOKUP('Seeding Plan'!$B84,EC_Dates,8,FALSE), IF('Seeding Plan'!$C$8=\"Southwest\",VLOOKUP('Seeding Plan'!$B84,SW_Dates,8,FALSE), IF('Seeding Plan'!$C$8=\"South_Central\",VLOOKUP('Seeding Plan'!$B84,SC_Dates,8,FALSE),IF('Seeding Plan'!$C$8=\"Southeast\",VLOOKUP('Seeding Plan'!$B84,SE_Dates,8,FALSE)))))))))))","v":""},""]
["Wheat, Winter","-","-","-","-","2021-08-06","2021-08-20","2021-10-07","2021-10-21",null,"Min",{"$f":"MIN(L132:L151)","v":"00:00:00"},{"$f":"MIN(M132:M151)","v":"00:00:00"},{"$f":"MIN(N132:N151)","v":"00:00:00"},{"$f":"MIN(O132:O151)","v":"00:00:00"},{"$f":"MIN(P132:P151)","v":"00:00:00"},{"$f":"MIN(Q132:Q151)","v":"00:00:00"},{"$f":"MIN(R132:R151)","v":"00:00:00"},{"$f":"MIN(S132:S151)","v":"00:00:00"}]
[null,null,null,null,null,null,null,null,null,null,"Max",{"$f":"MAX(L132:L151)","v":"00:00:00"},{"$f":"MAX(M132:M151)","v":"00:00:00"},"00:00:00","00:00:00","00:00:00","00:00:00","00:00:00","00:00:00"]
["Species","Central",null,null,null,null,null,null,null,null,null,null,{"$f":"COUNTIF(M132:M151,\"--\")","v":0},{"$f":"COUNTIF(N132:N151,\"--\")","v":0},null,null,{"$f":"COUNTIF(Q132:Q151,\"--\")","v":0},{"$f":"COUNTIF(R132:R151,\"--\")","v":0}]
[null,"Spring ",null,null,null,"Fall",null,null,null,null,"Fall",null,null,null,null,{"$f":"+IF(COUNTIF(P132:P151,\"-\")>=1, \"Invalid Species for seeding period\", MIN(P153:Q153))","v":"00:00:00"},{"$f":"+IF((COUNTIF(Q132:Q151,\"-\")>=1), \"Invalid Species for seeding period\", MAX(P153:Q153))","v":"00:00:00"},{"$f":"+IF(COUNTIF(R132:R151,\"-\")>=1, \"Invalid Species for seeding period\", MIN(R152:S152))","v":"00:00:00"},{"$f":"+IF(COUNTIF(S132:S151,\"-\")>=1, \"Invalid Species for seeding period\", MAX(R152:S152))","v":"00:00:00"}]
["Barley, Spring","2021-03-18","2021-04-01","2021-04-27","2021-05-25","2021-08-08","2021-08-22","2021-09-11","2021-09-25",null,"Spring/Summer",{"$f":"+IF(COUNTIF(L132:L151,\"-\")>=1, \"Invalid Species for seeding period\", MIN(L153:M153))","v":"00:00:00"},{"$f":"+IF(COUNTIF(M132:M151,\"-\")>=1, \"Invalid Species for seeding period\", MAX(L153:M153))","v":"00:00:00"},{"$f":"+IF(COUNTIF(N132:N151,\"-\")>=1, \"Invalid Species for seeding period\", MIN(N152:O152))","v":"00:00:00"},{"$f":"+IF(COUNTIF(O132:O151,\"-\")>=1, \"Invalid Species for seeding period\", MAX(N152:O152))","v":"00:00:00"},{"$f":"+P155","v":"00:00:00"},{"$f":"Q155","v":"00:00:00"},{"$f":"+R155","v":"00:00:00"},{"$f":"+S155","v":"00:00:00"}]
["Barley, Winter","-","-","-","-","2021-08-08","2021-08-22","2021-09-11","2021-09-25",null,"Spring/Summer",{"$f":"L156","v":"00:00:00"},{"$f":"IF(M158=-1,\"No preferred range for species selected.\",IF(M154>=1, \"No preferred range for species selected.\",M156))","v":"00:00:00"},{"$f":"IF(N158=-1,\"No preferred range for species selected.\",IF(M154>=1, \"No preferred range for species selected.\",N156))","v":"00:00:00"},{"$f":"IF(O156=44012, S156,O156)","v":"00:00:00"}]
["Mungbeans","-","2021-05-11","2021-08-07","-","-","-","-","-",null,"Reference",null,{"$f":"+IF(N156<M156, -1,1)","v":1},{"$f":"IF(N156<M156,-1,1)","v":1},null,null,{"$f":"IF(R155>Q155,-1,1)","v":1},{"$f":"IF(R155>Q155,-1,1)","v":1}]
["Buckwheat","-","2021-05-11","2021-09-11","--","--","2021-05-11","2021-09-11","-"]
["Camelina, Winter","-","-","-","-","2021-08-08","2021-08-22","2021-10-23","2021-11-05"]
["Clover, Berseem","2021-04-01","2021-04-14","2021-05-18","-","-","2021-08-08","2021-08-28","2021-09-11"]
["Clover, Crimson","2021-04-01","2021-04-14","2021-05-18","-","-","2021-08-08","2021-08-28","2021-09-11"]
["Clover, Red","2021-03-18","2021-04-01","2021-05-18","-","-","2021-08-08","2021-09-11","2021-09-18"]
["Clover, White","2021-03-18","2021-04-01","2021-05-18","-","-","2021-08-08","2021-09-11","2021-09-18"]
["Cowpea","-","2021-05-11","2021-08-07","-","-","-","-","-"]
["Flax","2021-03-18","2021-04-01","2021-05-11","2021-06-01","2021-07-18","2021-08-08","2021-09-11","2021-09-25"]
["Kale","2021-03-18","2021-04-01","2021-05-13","-","2021-07-04","2021-07-25","2021-09-11","2021-09-25"]
["Millet","-","2021-05-11","2021-08-07","-","-","-","-","-"]
["Mustard","2021-03-18","2021-04-01","2021-05-13","-","-","2021-08-08","2021-09-11","2021-09-25"]
["Oats","2021-03-18","2021-04-01","2021-04-27",{"$f":"I170","v":"2021-09-25"},{"$f":"B170","v":"2021-03-18"},"2021-08-22","2021-09-11","2021-09-25"]
["Pea, Field/Winter","-","2021-04-01","2021-05-18","-","-","2021-08-08","2021-08-28","2021-09-11"]
["Radish","2021-04-01","--","--",{"$f":"I172","v":"2021-09-25"},{"$f":"B172","v":"2021-04-01"},"2021-08-08","2021-09-11","2021-09-25"]
["Rapeseed","2021-03-18","2021-04-01","2021-05-11",{"$f":"I173","v":"2021-09-25"},{"$f":"B173","v":"2021-03-18"},"2021-08-08","2021-09-11","2021-09-25"]
["Rye, Winter/Cereal","-","-","-","-","2021-08-08","2021-08-22","2021-10-23","2021-11-05"]
["Ryegrass, Annual","-","2021-04-01","2021-05-11","2021-06-15","-","2021-07-18","2021-08-21","2021-09-25"]
["Sorghum, Forage","-","2021-05-11","2021-08-07","-","-","-","-","-"]
["Sorghum-sudangrass","-","2021-05-11","2021-08-07","-","-","-","-","-"]
["Sudangrass","-","2021-05-11","2021-08-07","-","-","-","-","-"]
["Sunflower","-","2021-04-27","2021-08-07","2021-08-28","-","-","-","-"]
["Sunn Hemp","-","2021-05-11","2021-08-07","2021-08-28","-","-","-","-"]
["Teff","-","2021-05-11","2021-08-07","2021-08-28","-","-","-","-"]
["Triticale, Winter","-","-","-","-","2021-08-08","2021-08-22","2021-10-23","2021-11-05"]
["Turnip","2021-04-01","--","--",{"$f":"I183","v":"2021-09-25"},{"$f":"B183","v":"2021-04-01"},"2021-08-08","2021-09-11","2021-09-25"]
["Vetch, Common","-","2021-04-01","2021-05-18","-","-","2021-07-25","2021-08-28","2021-09-11"]
["Vetch, Hairy","-","2021-04-01","2021-06-01","-","-","2021-08-08","2021-09-11","2021-09-18"]
["Wheat, Spring","2021-03-18","2021-04-01","2021-04-27","2021-05-25","2021-08-08","2021-08-22","2021-09-11","2021-09-25"]
["Wheat, Winter","-","-","-","-","2021-08-08","2021-08-22","2021-10-10","2021-10-22"]
[]
["Species","East Central"]
[null,"Spring ",null,null,null,"Fall"]
["Barley, Spring","2021-03-16","2021-03-30","2021-04-24","2021-05-23","2021-08-08","2021-08-23","2021-09-12","2021-09-27"]
["Barley, Winter","-","-","-","-","2021-08-08","2021-08-23","2021-09-12","2021-09-27"]
["Mungbeans","-","2021-05-08","2021-08-07","-","-","-","-","-"]
["Buckwheat","-","2021-05-08","2021-09-12","--","--","2021-05-08","2021-09-12","-"]
["Camelina, Winter","-","-","-","-","2021-08-08","2021-08-23","2021-10-25","2021-11-06"]
["Clover, Berseem","2021-03-30","2021-04-12","2021-05-16","-","-","2021-08-08","2021-08-29","2021-09-12"]
["Clover, Crimson","2021-03-30","2021-04-12","2021-05-16","-","-","2021-08-08","2021-08-29","2021-09-12"]
["Clover, Red","2021-03-16","2021-03-30","2021-05-16","-","-","2021-08-08","2021-09-12","2021-09-19"]
["Clover, White","2021-03-16","2021-03-30","2021-05-16","-","-","2021-08-08","2021-09-12","2021-09-19"]
["Cowpea","-","2021-05-08","2021-08-07","-","-"]
["Flax","2021-03-16","2021-03-30","2021-05-08","2021-05-30","2021-07-18","2021-08-08","2021-09-12","2021-09-27"]
["Kale","2021-03-16","2021-03-30","2021-05-11","-","2021-07-03","2021-07-25","2021-09-12","2021-09-27"]
["Millet","-","2021-05-07","2021-08-07","-","-","-","-","-"]
["Mustard","2021-03-16","2021-03-30","2021-05-11","-","-","2021-08-08","2021-09-12","2021-09-27"]
["Oats","2021-03-16","2021-03-30","2021-04-24",{"$f":"I205","v":"2021-09-27"},{"$f":"B205","v":"2021-03-16"},"2021-08-23","2021-09-12","2021-09-27"]
["Pea, Field/Winter","-","2021-03-30","2021-05-16","-","-","2021-08-08","2021-08-29","2021-09-12"]
["Radish","2021-03-30","--","--",{"$f":"I207","v":"2021-09-27"},{"$f":"B207","v":"2021-03-30"},"2021-08-08","2021-09-12","2021-09-27"]
["Rapeseed","2021-03-16","2021-03-30","2021-05-08",{"$f":"I208","v":"2021-09-27"},{"$f":"B208","v":"2021-03-16"},"2021-08-08","2021-09-12","2021-09-27"]
["Rye, Winter/Cereal","-","-","-","-","2021-08-08","2021-08-23","2021-10-25","2021-11-06"]
["Ryegrass, Annual","-","2021-03-30","2021-05-08","2021-06-14","-","2021-07-18","2021-08-22","2021-09-27"]
["Sorghum, Forage","-","2021-05-08","2021-08-07","-","-","-","-","-"]
["Sorghum-sudangrass","-","2021-05-08","2021-08-07","-","-","-","-","-"]
["Sudangrass","-","2021-05-08","2021-08-07","-","-","-","-","-"]
["Sunflower","-","2021-04-24","2021-08-07","2021-08-29","-","-","-","-"]
["Sunn Hemp","-","2021-05-08","2021-08-07","2021-08-29","-","-","-","-"]
["Teff","-","2021-05-08","2021-08-07","2021-08-29","-","-","-","-"]
["Triticale, Winter","-","-","-","-","2021-08-08","2021-08-23","2021-10-25","2021-11-06"]
["Turnip","2021-03-30","--","--",{"$f":"I218","v":"2021-09-27"},{"$f":"B218","v":"2021-03-30"},"2021-08-08","2021-09-12","2021-09-27"]
["Vetch, Common","-","2021-03-30","2021-05-16","-","-","2021-07-25","2021-08-29","2021-09-12"]
["Vetch, Hairy","-","2021-03-30","2021-05-30","-","-","2021-08-08","2021-09-12","2021-09-19"]
["Wheat, Spring","2021-03-16","2021-03-30","2021-04-24","2021-05-23","2021-08-08","2021-08-23","2021-09-12","2021-09-27"]
["Wheat, Winter","-","-","-","-","2021-08-08","2021-08-23","2021-10-12","2021-10-24"]
[]
["Species","Southwest"]
[null,"Spring ",null,null,null,"Fall"]
["Barley, Spring","2021-03-13","2021-03-27","2021-04-23","2021-05-22","2021-08-07","2021-08-21","2021-09-10","2021-09-25"]
["Barley, Winter","-","-","-","-","2021-08-07","2021-08-21","2021-09-10","2021-09-25"]
["Mungbeans","-","2021-05-07","2021-08-05","-","-","-","-","-"]
["Buckwheat","-","2021-05-07","2021-09-10","--","--","2021-05-07","2021-09-10","-"]
["Camelina, Winter","-","-","-","-","2021-08-07","2021-08-21","2021-10-26","2021-11-08"]
["Clover, Berseem","2021-03-27","2021-04-10","2021-05-15","-","-","2021-08-07","2021-08-27","2021-09-10"]
["Clover, Crimson","2021-03-27","2021-04-10","2021-05-15","-","-","2021-08-07","2021-08-27","2021-09-10"]
["Clover, Red","2021-03-14","2021-03-27","2021-05-15","-","-","2021-08-07","2021-09-10","2021-09-17"]
["Clover, White","2021-03-14","2021-03-27","2021-05-15","-","-","2021-08-07","2021-09-10","2021-09-17"]
["Cowpea","-","2021-05-07","2021-08-05","-","-","-","-","-"]
["Flax","2021-03-14","2021-03-27","2021-05-07","2021-05-29","2021-07-16","2021-08-07","2021-09-10","2021-09-25"]
["Kale","2021-03-14","2021-03-27","2021-05-09","-","2021-07-02","2021-07-23","2021-09-10","2021-09-25"]
["Millet","-","2021-05-07","2021-08-05","-","-","-","-","-"]
["Mustard","2021-03-14","2021-03-27","2021-05-09","-","-","2021-08-07","2021-09-10","2021-09-25"]
["Oats","2021-03-13","2021-03-27","2021-04-23",{"$f":"I240","v":"2021-09-25"},{"$f":"B240","v":"2021-03-13"},"2021-08-21","2021-09-10","2021-09-25"]
["Pea, Field/Winter","-","2021-03-27","2021-05-15","-","-","2021-08-07","2021-08-27","2021-09-10"]
["Radish","2021-03-27","--","--",{"$f":"I242","v":"2021-09-25"},{"$f":"B242","v":"2021-03-27"},"2021-08-07","2021-09-10","2021-09-25"]
["Rapeseed","2021-03-14","2021-03-27","2021-05-07",{"$f":"I243","v":"2021-09-25"},{"$f":"B243","v":"2021-03-14"},"2021-08-07","2021-09-10","2021-09-25"]
["Rye, Winter/Cereal","-","-","-","-","2021-08-07","2021-08-21","2021-10-26","2021-11-08"]
["Ryegrass, Annual","-","2021-03-27","2021-05-07","2021-06-12","-","2021-07-16","2021-08-20","2021-09-25"]
["Sorghum, Forage","-","2021-05-07","2021-08-05","-","-","-","-","-"]
["Sorghum-sudangrass","-","2021-05-07","2021-08-05","-","-","-","-","-"]
["Sudangrass","-","2021-05-07","2021-08-05","-","-","-","-","-"]
["Sunflower","-","2021-04-23","2021-08-05","2021-08-27","-","-","-","-"]
["Sunn Hemp","-","2021-05-07","2021-08-05","2021-08-27","-","-","-","-"]
["Teff","-","2021-05-07","2021-08-05","2021-08-27","-","-","-","-"]
["Triticale, Winter","-","-","-","-","2021-08-07","2021-08-21","2021-10-26","2021-11-08"]
["Turnip","2021-03-27","--","--",{"$f":"I253","v":"2021-09-25"},{"$f":"B253","v":"2021-03-27"},"2021-08-07","2021-09-10","2021-09-25"]
["Vetch, Common","-","2021-03-27","2021-05-15","-","-","2021-07-23","2021-08-27","2021-09-10"]
["Vetch, Hairy","-","2021-03-27","2021-05-29","-","-","2021-08-07","2021-09-10","2021-09-17"]
["Wheat, Spring","2021-03-13","2021-03-27","2021-04-23","2021-05-22","2021-08-07","2021-08-21","2021-09-10","2021-09-25"]
["Wheat, Winter","-","-","-","-","2021-08-07","2021-08-21","2021-10-10","2021-10-25"]
[]
["Species","South Central"]
[null,"Spring ",null,null,null,"Fall"]
["Barley, Spring","2021-03-15","2021-03-29","2021-04-23","2021-05-22","2021-08-08","2021-08-22","2021-09-12","2021-09-26"]
["Barley, Winter","-","-","-","-","2021-08-08","2021-08-22","2021-09-12","2021-09-26"]
["Mungbeans","-","2021-05-08","2021-08-07","-","-","-","-","-"]
["Buckwheat","-","2021-05-08","2021-09-12","--","--","2021-05-08","2021-09-12","-"]
["Camelina, Winter","-","-","-","-","2021-08-08","2021-08-22","2021-10-27","2021-11-10"]
["Clover, Berseem","2021-03-29","2021-04-11","2021-05-15","-","-","2021-08-08","2021-08-28","2021-09-12"]
["Clover, Crimson","2021-03-29","2021-04-11","2021-05-15","-","-","2021-08-08","2021-08-28","2021-09-12"]
["Clover, Red","2021-03-15","2021-03-29","2021-05-15","-","-","2021-08-08","2021-09-12","2021-09-19"]
["Clover, White","2021-03-15","2021-03-29","2021-05-15","-","-","2021-08-08","2021-09-12","2021-09-19"]
["Cowpea","-","2021-05-08","2021-08-07","-","-","-","-","-"]
["Flax","2021-03-15","2021-03-29","2021-05-08","2021-05-29","2021-07-17","2021-08-08","2021-09-12","2021-09-26"]
["Kale","2021-03-15","2021-03-29","2021-05-10","-","2021-07-03","2021-07-24","2021-09-12","2021-09-26"]
["Millet","-","2021-05-08","2021-08-07","-","-","-","-","-"]
["Mustard","2021-03-15","2021-03-29","2021-05-10","-","-","2021-08-08","2021-09-12","2021-09-26"]
["Oats","2021-03-15","2021-03-29","2021-04-23",{"$f":"I275","v":"2021-09-26"},{"$f":"B275","v":"2021-03-15"},"2021-08-22","2021-09-12","2021-09-26"]
["Pea, Field/Winter","-","2021-03-29","2021-05-15","-","-","2021-08-08","2021-08-28","2021-09-12"]
["Radish","2021-03-29","--","--",{"$f":"I277","v":"2021-09-26"},{"$f":"B277","v":"2021-03-29"},"2021-08-08","2021-09-12","2021-09-26"]
["Rapeseed","2021-03-15","2021-03-29","2021-05-08",{"$f":"I278","v":"2021-09-26"},{"$f":"B278","v":"2021-03-15"},"2021-08-08","2021-09-12","2021-09-26"]
["Rye, Winter/Cereal","-","-","-","-","2021-08-08","2021-08-22","2021-10-27","2021-11-10"]
["Ryegrass, Annual","-","2021-03-29","2021-05-08","2021-06-13","-","2021-07-17","2021-08-21","2021-09-26"]
["Sorghum, Forage","-","2021-05-08","2021-08-07","-","-","-","-","-"]
["Sorghum-sudangrass","-","2021-05-08","2021-08-07","-","-","-","-","-"]
["Sudangrass","-","2021-05-08","2021-08-07","-","-","-","-","-"]
["Sunflower","-","2021-04-23","2021-08-07","2021-08-28","-","-","-","-"]
["Sunn Hemp","-","2021-05-08","2021-08-07","2021-08-28","-","-","-","-"]
["Teff","-","2021-05-08","2021-08-07","2021-08-28","-","-","-","-"]
["Triticale, Winter","-","-","-","-","2021-08-08","2021-08-22","2021-10-27","2021-11-10"]
["Turnip","2021-03-29","--","--",{"$f":"I288","v":"2021-09-26"},{"$f":"B288","v":"2021-03-29"},"2021-08-08","2021-09-12","2021-09-26"]
["Vetch, Common","-","2021-03-29","2021-05-15","-","-","2021-07-24","2021-08-28","2021-09-12"]
["Vetch, Hairy","-","2021-03-29","2021-05-29","-","-","2021-08-08","2021-09-12","2021-09-19"]
["Wheat, Spring","2021-03-15","2021-03-29","2021-04-23","2021-05-22","2021-08-08","2021-08-22","2021-09-12","2021-09-26"]
["Wheat, Winter","-","-","-","-","2021-08-08","2021-08-22","2021-10-12","2021-10-26"]
[]
["Species","Southeast"]
[null,"Spring ",null,null,null,"Fall"]
["Barley, Spring","2021-03-12","2021-03-25","2021-04-18","2021-05-19","2021-08-09","2021-08-24","2021-09-15","2021-10-01"]
["Barley, Winter","-","-","-","-","2021-08-09","2021-08-24","2021-09-15","2021-10-01"]
["Mungbeans","-","2021-05-04","2021-08-08","-","-","-","-","-"]
["Buckwheat","-","2021-05-04","2021-09-15","--","--","2021-05-04","2021-09-15","-"]
["Camelina, Winter","-","-","-","-","2021-08-09","2021-08-24","2021-10-31","2021-11-15"]
["Clover, Berseem","2021-03-25","2021-04-08","2021-05-11","-","-","2021-08-09","2021-08-31","2021-09-15"]
["Clover, Crimson","2021-03-25","2021-04-08","2021-05-11","-","-","2021-08-09","2021-08-31","2021-09-15"]
["Clover, Red","2021-03-12","2021-03-25","2021-05-11","-","-","2021-08-09","2021-09-15","2021-09-23"]
["Clover, White","2021-03-12","2021-03-25","2021-05-11","-","-","2021-08-09","2021-09-15","2021-09-23"]
["Cowpea","-","2021-05-04","2021-08-08","-","-","-","-","-"]
["Flax","2021-03-12","2021-03-25","2021-05-04","2021-05-27","2021-07-17","2021-08-09","2021-09-15","2021-10-01"]
["Kale","2021-03-12","2021-03-25","2021-05-06","-","2021-07-02","2021-07-25","2021-09-15","2021-10-01"]
["Millet","-","2021-05-04","2021-08-08","-","-","-","-","-"]
["Mustard","2021-03-12","2021-03-25","2021-05-06","-","-","2021-08-09","2021-09-15","2021-10-01"]
["Oats","2021-03-12","2021-03-25","2021-04-18",{"$f":"I310","v":"2021-10-01"},{"$f":"B310","v":"2021-03-12"},"2021-08-24","2021-09-15","2021-10-01"]
["Pea, Field/Winter","-","2021-03-25","2021-05-11","-","-","2021-08-09","2021-08-31","2021-09-15"]
["Radish","2021-03-25","--","--",{"$f":"I312","v":"2021-10-01"},{"$f":"B312","v":"2021-03-25"},"2021-08-09","2021-09-15","2021-10-01"]
["Rapeseed","2021-03-12","2021-03-25","2021-05-04",{"$f":"I313","v":"2021-10-01"},{"$f":"B313","v":"2021-03-12"},"2021-08-09","2021-09-15","2021-10-01"]
["Rye, Winter/Cereal","-","-","-","-","2021-08-09","2021-08-24","2021-10-31","2021-11-15"]
["Ryegrass, Annual","-","2021-03-25","2021-05-04","2021-06-11","-","2021-07-17","2021-08-23","2021-10-01"]
["Sorghum, Forage","-","2021-05-04","2021-08-08","-","-","-","-","-"]
["Sorghum-sudangrass","-","2021-05-04","2021-08-08","-","-","-","-","-"]
["Sudangrass","-","2021-05-04","2021-08-08","-","-","-","-","-"]
["Sunflower","-","2021-04-18","2021-08-08","2021-08-31","-","-","-","-"]
["Sunn Hemp","-","2021-05-04","2021-08-08","2021-08-31","-","-","-","-"]
["Teff","-","2021-05-04","2021-08-08","2021-08-31","-","-","-","-"]
["Triticale, Winter","-","-","-","-","2021-08-09","2021-08-24","2021-10-31","2021-11-15"]
["Turnip","2021-03-25","--","--",{"$f":"I323","v":"2021-10-01"},{"$f":"B323","v":"2021-03-25"},"2021-08-09","2021-09-15","2021-10-01"]
["Vetch, Common","-","2021-03-25","2021-05-11","-","-","2021-07-25","2021-08-31","2021-09-15"]
["Vetch, Hairy","-","2021-03-25","2021-05-27","-","-","2021-08-09","2021-09-15","2021-09-23"]
["Wheat, Spring","2021-03-12","2021-03-25","2021-04-18","2021-05-19","2021-08-09","2021-08-24","2021-09-15","2021-10-01"]
["Wheat, Winter","-","-","-","-","2021-08-09","2021-08-24","2021-10-17","2021-10-30"]

{"sheet":"Statements","index":7,"n_rows":5,"n_cols":2,"rows_kept":5,"cut":false,"hidden":true,"merged":[[1,1,1,12],[4,1,4,12]]}
[]
["Spring","Spring seeded cover crops need to be seeded as soon as possible in the spring.  Cover crop will be allowed to grow for a minimum of 5 weeks after emergence before termination (minimum of 6 weeks after seeding)."]
[]
[]
["Aerial","Successful establishment of cover crops with an aerial or broadcast not incorporated seeding depends on having adequate moisture for germination and establishment. A moist seedbed at time of application or a forecast of rain within ~10 days of seeding is recommended."]

{"sheet":"Conditional_Formatting","index":8,"n_rows":327,"n_cols":34,"rows_kept":327,"cut":false,"hidden":true,"merged":[[259,20,259,23],[259,24,259,27],[259,28,259,31],[259,32,259,33],[258,2,258,33],[259,2,259,3],[259,4,259,7],[259,8,259,11],[259,12,259,15],[259,16,259,19],[224,20,224,23],[224,24,224,27],[224,28,224,31],[224,32,224,33],[223,2,223,33],[224,2,224,3],[224,4,224,7],[224,8,224,11],[224,12,224,15],[224,16,224,19],[189,20,189,23],[189,24,189,27],[189,28,189,31],[189,32,189,33],[188,2,188,33],[189,2,189,3],[189,4,189,7],[189,8,189,11],[189,12,189,15],[189,16,189,19],[154,24,154,27],[49,28,49,31],[154,28,154,31],[154,32,154,33],[153,2,153,33],[154,2,154,3],[154,4,154,7],[154,8,154,11],[154,12,154,15],[154,16,154,19],[154,20,154,23],[84,4,84,7],[84,8,84,11],[84,12,84,15],[84,24,84,27],[84,28,84,31],[84,16,84,19],[84,20,84,23],[119,24,119,27],[119,28,119,31],[119,32,119,33],[118,2,118,33],[119,2,119,3],[119,4,119,7],[119,8,119,11],[119,12,119,15],[119,16,119,19],[119,20,119,23],[84,32,84,33],[84,2,84,3],[14,20,14,23],[14,24,14,27],[14,28,14,31],[14,32,14,33],[83,2,83,33],[48,2,48,33],[49,2,49,3],[49,4,49,7],[49,8,49,11],[49,12,49,15],[49,16,49,19],[49,20,49,23],[49,24,49,27],[49,32,49,33],[13,2,13,19],[14,2,14,3],[14,4,14,7],[14,8,14,11],[14,12,14,15],[14,16,14,19],[293,2,293,33],[294,2,294,3],[294,4,294,7],[294,8,294,11],[294,12,294,15],[294,16,294,19],[294,20,294,23],[294,24,294,27],[294,28,294,31],[294,32,294,33]]}
[]
[null,null,"Click the button for your Zone to show the seeding dates."]
[]
[null,null," "]
[]
[]
[]
[]
[]
[]
[]
[]
[null,{"$f":"IF('Seeding Plan'!$C$8=\"Northwest\",\"Northwest_CF\",IF('Seeding Plan'!$C$8=\"North_Central\",\"North_Central_CF\"))","v":false}]
[null,"Species","Northwest"]
[null,null,"March",null,"April",null,null,null,"May",null,null,null,"June",null,null,null,"July",null,null,null,"August",null,null,null,"September",null,null,null,"October",null,null,null,"November"]
[null,"Barley, Spring","y","y","g","g","g","g","g","y","y","y","b","b","b","b","b","b","b","b","y","y","g","g","g","y","y","b","b","b","b","b","b","b"]
[null,"Barley, Winter","b","b","b","b","b","b","b","b","b","b","b","b","b","b","b","b","b","b","y","y","g","g","g","y","y","b","b","b","b","b","b","b"]
[null,"Mungbeans","b","b","b","b","b","b","b","g","g","g","g","g","g","g","g","g","g","g","g","b","b","b","b","b","b","b","b","b","b","b","b","b"]
[null,"Buckwheat","b","b","b","b","b","b","b","g","g","g","g","g","g","g","g","g","g","g","g","g","g","g","g","b","b","b","b","b","b","b","b","b"]
[null,"Camelina, Winter","b","b","b","b","b","b","b","b","b","b","b","b","b","b","b","b","b","b","y","y","g","g","g","g","g","g","g","g","y","y","b","b"]
[null,"Clover, Berseem","b","b","y","y","g","g","g","g","g","b","b","b","b","b","b","b","b","b","g","g","g","g","y","b","b","b","b","b","b","b","b","b"]
[null,"Clover, Crimson","b","b","y","y","g","g","g","g","g","b","b","b","b","b","b","b","b","b","g","g","g","g","y","b","b","b","b","b","b","b","b","b"]
[null,"Clover, Red","y","y","g","g","g","g","g","g","g","b","b","b","b","b","b","b","b","b","g","g","g","g","g","y","b","b","b","b","b","b","b","b"]
[null,"Clover, White","y","y","g","g","g","g","g","g","g","b","b","b","b","b","b","b","b","b","g","g","g","g","g","y","b","b","b","b","b","b","b","b"]
[null,"Cowpea","b","b","b","b","b","b","b","g","g","g","g","g","g","g","g","g","g","g","g","b","b","b","b","b","b","b","b","b","b","b","b","b"]
[null,"Flax","y","y","g","g","g","g","g","g","y","y","y","b","b","b","b","b","y","y","g","g","g","g","g","y","y","b","b","b","b","b","b","b"]
[null,"Kale","y","y","g","g","g","g","g","g","b","b","b","b","b","b","y","y","y","g","g","g","g","g","g","y","y","b","b","b","b","b","b","b"]
[null,"Millet","b","b","b","b","b","b","b","g","g","g","g","g","g","g","g","g","g","g","g","b","b","b","b","b","b","b","b","b","b","b","b","b"]
[null,"Mustard","y","y","g","g","g","g","g","g","b","b","b","b","b","b","b","b","b","b","g","g","g","g","g","y","y","b","b","b","b","b","b","b"]
[null,"Oats","y","y","g","g","g","g","g","y","y","y","y","y","y","y","y","y","y","y","y","y","g","g","g","y","y","b","b","b","b","b","b","b"]
[null,"Pea, Field/Winter","b","b","g","g","g","g","g","g","g","b","b","b","b","b","b","b","b","b","g","g","g","g","y","b","b","b","b","b","b","b","b","b"]
[null,"Radish","b","b","y","y","y","y","y","y","y","y","y","y","y","y","y","y","y","y","g","g","g","g","g","y","y","b","b","b","b","b","b","b"]
[null,"Rapeseed","y","y","g","g","g","g","g","g","y","y","y","y","y","y","y","y","y","y","g","g","g","g","g","y","y","b","b","b","b","b","b","b"]
[null,"Rye, Winter/Cereal","b","b","b","b","b","b","b","b","b","b","b","b","b","b","b","b","b","b","y","y","g","g","g","g","g","g","g","g","y","y","b","b"]
[null,"Ryegrass, Annual","b","b","g","g","g","g","g","g","y","y","y","y","y","b","b","b","g","g","g","g","g","y","y","y","y","b","b","b","b","b","b","b"]
[null,"Sorghum, Forage","b","b","b","b","b","b","b","g","g","g","g","g","g","g","g","g","g","g","g","b","b","b","b","b","b","b","b","b","b","b","b","b"]
[null,"Sorghum-sudangrass","b","b","b","b","b","b","b","g","g","g","g","g","g","g","g","g","g","g","g","b","b","b","b","b","b","b","b","b","b","b","b","b"]
[null,"Sudangrass","b","b","b","b","b","b","b","g","g","g","g","g","g","g","g","g","g","g","g","b","b","b","b","b","b","b","b","b","b","b","b","b"]
[null,"Sunflower","b","b","b","b","b","b","g","g","g","g","g","g","g","g","g","g","g","g","g","y","y","y","b","b","b","b","b","b","b","b","b","b"]
[null,"Sunn Hemp","b","b","b","b","b","b","b","g","g","g","g","g","g","g","g","g","g","g","g","y","y","y","b","b","b","b","b","b","b","b","b","b"]
[null,"Teff","b","b","b","b","b","b","b","g","g","g","g","g","g","g","g","g","g","g","g","y","y","y","b","b","b","b","b","b","b","b","b","b"]
[null,"Triticale, Winter","b","b","b","b","b","b","b","b","b","b","b","b","b","b","b","b","b","b","y","y","g","g","g","g","g","g","g","g","y","y","b","b"]
[null,"Turnip","b","b","y","y","y","y","y","y","y","y","y","y","y","y","y","y","y","y","g","g","g","g","g","y","y","b","b","b","b","b","b","b"]
[null,"Vetch, Common","b","b","g","g","g","g","g","g","g","b","b","b","b","b","b","b","b","g","g","g","g","g","y","b","b","b","b","b","b","b","b","b"]
[null,"Vetch, Hairy","b","b","g","g","g","g","g","g","g","g","g","b","b","b","b","b","b","b","g","g","g","g","g","y","b","b","b","b","b","b","b","b"]
[null,"Wheat, Spring","y","y","g","g","g","g","g","y","y","y","b","b","b","b","b","b","b","b","y","y","g","g","g","y","y","b","b","b","b","b","b","b"]
[null,"Wheat, Winter","b","b","b","b","b","b","b","b","b","b","b","b","b","b","b","b","b","b","y","y","g","g","g","g","g","g","g","y","b","b","b","b"]
[]
[null,"Species","North Central"]
[null,null,"March",null,"April",null,null,null,"May",null,null,null,"June",null,null,null,"July",null,null,null,"August",null,null,null,"September",null,null,null,"October",null,null,null,"November"]
[null,"Barley, Spring","y","y","g","g","g","g","y","y","y","y","b","b","b","b","b","b","b","b","y","y","g","g","g","y","y","b","b","b","b","b","b","b"]
[null,"Barley, Winter","b","b","b","b","b","b","b","b","b","b","b","b","b","b","b","b","b","b","y","y","g","g","g","y","y","b","b","b","b","b","b","b"]
[null,"Mungbeans","b","b","b","b","b","b","b","g","g","g","g","g","g","g","g","g","g","g","g","b","b","b","b","b","b","b","b","b","b","b","b","b"]
[null,"Buckwheat","b","b","b","b","b","b","b","g","g","g","g","g","g","g","g","g","g","g","g","g","g","g","g","b","b","b","b","b","b","b","b","b"]
[null,"Camelina, Winter","b","b","b","b","b","b","b","b","b","b","b","b","b","b","b","b","b","b","y","y","g","g","g","g","g","g","g","g","g","y","y","b"]
[null,"Clover, Berseem","b","b","y","g","g","g","g","g","g","b","b","b","b","b","b","b","b","b","g","g","g","g","y","b","b","b","b","b","b","b","b","b"]
[null,"Clover, Crimson","b","b","y","g","g","g","g","g","g","b","b","b","b","b","b","b","b","b","g","g","g","g","y","b","b","b","b","b","b","b","b","b"]
[null,"Clover, Red","y","y","g","g","g","g","g","g","g","b","b","b","b","b","b","b","b","b","g","g","g","g","g","y","b","b","b","b","b","b","b","b"]
[null,"Clover, White","y","y","g","g","g","g","g","g","g","b","b","b","b","b","b","b","b","b","g","g","g","g","g","y","b","b","b","b","b","b","b","b"]
[null,"Cowpea","b","b","b","b","b","b","b","g","g","g","g","g","g","g","g","g","g","g","g","b","b","b","b","b","b","b","b","b","b","b","b","b"]
[null,"Flax","y","y","g","g","g","g","g","g","y","y","y","b","b","b","b","b","y","y","g","g","g","g","g","y","y","b","b","b","b","b","b","b"]
[null,"Kale","y","y","g","g","g","g","g","g","b","b","b","b","b","b","y","y","y","g","g","g","g","g","g","y","y","b","b","b","b","b","b","b"]
[null,"Millet","b","b","b","b","b","b","b","g","g","g","g","g","g","g","g","g","g","g","g","b","b","b","b","b","b","b","b","b","b","b","b","b"]
[null,"Mustard","y","y","g","g","g","g","g","g","b","b","b","b","b","b","b","b","b","b","g","g","g","g","g","y","y","b","b","b","b","b","b","b"]
[null,"Oats","y","y","g","g","g","g","y","y","y","y","y","y","y","y","y","y","y","y","y","y","g","g","g","y","y","b","b","b","b","b","b","b"]
[null,"Pea, Field/Winter","b","b","g","g","g","g","g","g","g","b","b","b","b","b","b","b","b","b","g","g","g","g","y","b","b","b","b","b","b","b","b","b"]
[null,"Radish","b","b","y","y","y","y","y","y","y","y","y","y","y","y","y","y","y","y","g","g","g","g","g","y","y","b","b","b","b","b","b","b"]
[null,"Rapeseed","y","y","g","g","g","g","g","g","y","y","y","y","y","y","y","y","y","y","g","g","g","g","g","y","y","b","b","b","b","b","b","b"]
[null,"Rye, Winter/Cereal","b","b","b","b","b","b","b","b","b","b","b","b","b","b","b","b","b","b","y","y","g","g","g","g","g","g","g","g","g","y","y","b"]
[null,"Ryegrass, Annual","b","b","g","g","g","g","g","g","y","y","y","y","b","b","b","b","g","g","g","g","g","y","y","y","y","b","b","b","b","b","b","b"]
[null,"Sorghum, Forage","b","b","b","b","b","b","b","g","g","g","g","g","g","g","g","g","g","g","g","b","b","b","b","b","b","b","b","b","b","b","b","b"]
[null,"Sorghum-sudangrass","b","b","b","b","b","b","b","g","g","g","g","g","g","g","g","g","g","g","g","b","b","b","b","b","b","b","b","b","b","b","b","b"]
[null,"Sudangrass","b","b","b","b","b","b","b","g","g","g","g","g","g","g","g","g","g","g","g","b","b","b","b","b","b","b","b","b","b","b","b","b"]
[null,"Sunflower","b","b","b","b","b","g","g","g","g","g","g","g","g","g","g","g","g","g","g","y","y","y","b","b","b","b","b","b","b","b","b","b"]
[null,"Sunn Hemp","b","b","b","b","b","b","b","g","g","g","g","g","g","g","g","g","g","g","g","y","y","y","b","b","b","b","b","b","b","b","b","b"]
[null,"Teff","b","b","b","b","b","b","b","g","g","g","g","g","g","g","g","g","g","g","g","y","y","y","b","b","b","b","b","b","b","b","b","b"]
[null,"Triticale, Winter","b","b","b","b","b","b","b","b","b","b","b","b","b","b","b","b","b","b","y","y","g","g","g","g","g","g","g","g","g","y","y","b"]
[null,"Turnip","b","b","y","y","y","y","y","y","y","y","y","y","y","y","y","y","y","y","g","g","g","g","g","y","y","b","b","b","b","b","b","b"]
[null,"Vetch, Common","b","b","g","g","g","g","g","g","g","b","b","b","b","b","b","b","b","g","g","g","g","g","y","b","b","b","b","b","b","b","b","b"]
[null,"Vetch, Hairy","b","b","g","g","g","g","g","g","g","g","g","b","b","b","b","b","b","b","g","g","g","g","g","y","b","b","b","b","b","b","b","b"]
[null,"Wheat, Spring","y","y","g","g","g","g","y","y","y","y","b","b","b","b","b","b","b","b","y","y","g","g","g","y","y","b","b","b","b","b","b","b"]
[null,"Wheat, Winter","b","b","b","b","b","b","b","b","b","b","b","b","b","b","b","b","b","b","y","y","g","g","g","g","g","g","g","y","y","b","b","b"]
[]
[null,"Species","Northeast"]
[null,null,"March",null,"April",null,null,null,"May",null,null,null,"June",null,null,null,"July",null,null,null,"August",null,null,null,"September",null,null,null,"October",null,null,null,"November"]
[null,"Barley, Spring","y","y","g","g","g","g","g","y","y","y","b","b","b","b","b","b","b","b","y","y","g","g","g","y","y","b","b","b","b","b","b","b"]
[null,"Barley, Winter","b","b","b","b","b","b","b","b","b","b","b","b","b","b","b","b","b","b","y","y","g","g","g","y","y","b","b","b","b","b","b","b"]
[null,"Mungbeans","b","b","b","b","b","b","b","g","g","g","g","g","g","g","g","g","g","g","g","b","b","b","b","b","b","b","b","b","b","b","b","b"]
[null,"Buckwheat","b","b","b","b","b","b","b","g","g","g","g","g","g","g","g","g","g","g","g","g","g","g","g","b","b","b","b","b","b","b","b","b"]
[null,"Camelina, Winter","b","b","b","b","b","b","b","b","b","b","b","b","b","b","b","b","b","b","y","y","g","g","g","g","g","g","g","g","g","y","y","b"]
[null,"Clover, Berseem","b","b","y","g","g","g","g","g","g","b","b","b","b","b","b","b","b","b","g","g","g","g","y","b","b","b","b","b","b","b","b","b"]
[null,"Clover, Crimson","b","b","y","g","g","g","g","g","g","b","b","b","b","b","b","b","b","b","g","g","g","g","y","b","b","b","b","b","b","b","b","b"]
[null,"Clover, Red","y","y","g","g","g","g","g","g","g","b","b","b","b","b","b","b","b","b","g","g","g","g","g","y","b","b","b","b","b","b","b","b"]
[null,"Clover, White","y","y","g","g","g","g","g","g","g","b","b","b","b","b","b","b","b","b","g","g","g","g","g","y","b","b","b","b","b","b","b","b"]
[null,"Cowpea","b","b","b","b","b","b","b","g","g","g","g","g","g","g","g","g","g","g","g","b","b","b","b","b","b","b","b","b","b","b","b","b"]
[null,"Flax","y","y","g","g","g","g","g","g","y","y","y","b","b","b","b","b","y","y","g","g","g","g","g","y","y","b","b","b","b","b","b","b"]
[null,"Kale","y","y","g","g","g","g","g","g","b","b","b","b","b","b","y","y","y","g","g","g","g","g","g","y","y","b","b","b","b","b","b","b"]
[null,"Millet","b","b","b","b","b","b","b","g","g","g","g","g","g","g","g","g","g","g","g","b","b","b","b","b","b","b","b","b","b","b","b","b"]
[null,"Mustard","y","y","g","g","g","g","g","g","b","b","b","b","b","b","b","b","b","b","g","g","g","g","g","y","y","b","b","b","b","b","b","b"]
[null,"Oats","y","y","g","g","g","g","g","y","y","y","y","y","y","y","y","y","y","y","y","y","g","g","g","y","y","b","b","b","b","b","b","b"]
[null,"Pea, Field/Winter","b","b","g","g","g","g","g","g","g","b","b","b","b","b","b","b","b","b","g","g","g","g","y","b","b","b","b","b","b","b","b","b"]
[null,"Radish","b","b","y","y","y","y","y","y","y","y","y","y","y","y","y","y","y","y","g","g","g","g","g","y","y","b","b","b","b","b","b","b"]
[null,"Rapeseed","y","y","g","g","g","g","g","g","y","y","y","y","y","y","y","y","y","y","g","g","g","g","g","y","y","b","b","b","b","b","b","b"]
[null,"Rye, Winter/Cereal","b","b","b","b","b","b","b","b","b","b","b","b","b","b","b","b","b","b","y","y","g","g","g","g","g","g","g","g","g","y","y","b"]
[null,"Ryegrass, Annual","b","b","g","g","g","g","g","g","y","y","y","y","y","b","b","b","g","g","g","g","g","y","y","y","y","b","b","b","b","b","b","b"]
[null,"Sorghum, Forage","b","b","b","b","b","b","b","g","g","g","g","g","g","g","g","g","g","g","g","b","b","b","b","b","b","b","b","b","b","b","b","b"]
[null,"Sorghum-sudangrass","b","b","b","b","b","b","b","g","g","g","g","g","g","g","g","g","g","g","g","b","b","b","b","b","b","b","b","b","b","b","b","b"]
[null,"Sudangrass","b","b","b","b","b","b","b","g","g","g","g","g","g","g","g","g","g","g","g","b","b","b","b","b","b","b","b","b","b","b","b","b"]
[null,"Sunflower","b","b","b","b","b","b","g","g","g","g","g","g","g","g","g","g","g","g","g","y","y","y","b","b","b","b","b","b","b","b","b","b"]
[null,"Sunn Hemp","b","b","b","b","b","b","b","g","g","g","g","g","g","g","g","g","g","g","g","y","y","y","b","b","b","b","b","b","b","b","b","b"]
[null,"Teff","b","b","b","b","b","b","b","g","g","g","g","g","g","g","g","g","g","g","g","y","y","y","b","b","b","b","b","b","b","b","b","b"]
[null,"Triticale, Winter","b","b","b","b","b","b","b","b","b","b","b","b","b","b","b","b","b","b","y","y","g","g","g","g","g","g","g","g","g","y","y","b"]
[null,"Turnip","b","b","y","y","y","y","y","y","y","y","y","y","y","y","y","y","y","y","g","g","g","g","g","y","y","b","b","b","b","b","b","b"]
[null,"Vetch, Common","b","b","g","g","g","g","g","g","g","b","b","b","b","b","b","b","b","g","g","g","g","g","y","b","b","b","b","b","b","b","b","b"]
[null,"Vetch, Hairy","b","b","g","g","g","g","g","g","g","g","g","b","b","b","b","b","b","b","g","g","g","g","g","y","b","b","b","b","b","b","b","b"]
[null,"Wheat, Spring","y","y","g","g","g","g","g","y","y","y","b","b","b","b","b","b","b","b","y","y","g","g","g","y","y","b","b","b","b","b","b","b"]
[null,"Wheat, Winter","b","b","b","b","b","b","b","b","b","b","b","b","b","b","b","b","b","b","y","y","g","g","g","g","g","g","g","y","y","b","b","b"]
[]
[null,"Species","West Central"]
[null,null,"March",null,"April",null,null,null,"May",null,null,null,"June",null,null,null,"July",null,null,null,"August",null,null,null,"September",null,null,null,"October",null,null,null,"November"]
[null,"Barley, Spring","y","y","g","g","g","g","y","y","y","b","b","b","b","b","b","b","b","b","y","y","g","g","g","y","y","b","b","b","b","b","b","b"]
[null,"Barley, Winter","b","b","b","b","b","b","b","b","b","b","b","b","b","b","b","b","b","b","y","y","g","g","g","y","y","b","b","b","b","b","b","b"]
[null,"Mungbeans","b","b","b","b","b","b","b","g","g","g","g","g","g","g","g","g","g","g","g","b","b","b","b","b","b","b","b","b","b","b","b","b"]
[null,"Buckwheat","b","b","b","b","b","b","b","g","g","g","g","g","g","g","g","g","g","g","g","g","g","g","g","b","b","b","b","b","b","b","b","b"]
[null,"Camelina, Winter","b","b","b","b","b","b","b","b","b","b","b","b","b","b","b","b","b","b","y","y","g","g","g","g","g","g","g","g","g","y","y","b"]
[null,"Clover, Berseem","b","b","y","g","g","g","g","g","g","b","b","b","b","b","b","b","b","b","g","g","g","g","y","b","b","b","b","b","b","b","b","b"]
[null,"Clover, Crimson","b","b","y","g","g","g","g","g","g","b","b","b","b","b","b","b","b","b","g","g","g","g","y","b","b","b","b","b","b","b","b","b"]
[null,"Clover, Red","y","y","g","g","g","g","g","g","g","b","b","b","b","b","b","b","b","b","g","g","g","g","g","y","b","b","b","b","b","b","b","b"]
[null,"Clover, White","y","y","g","g","g","g","g","g","g","b","b","b","b","b","b","b","b","b","g","g","g","g","g","y","b","b","b","b","b","b","b","b"]
[null,"Cowpea","b","b","b","b","b","b","b","g","g","g","g","g","g","g","g","g","g","g","g","b","b","b","b","b","b","b","b","b","b","b","b","b"]
[null,"Flax","y","y","g","g","g","g","g","g","y","y","y","b","b","b","b","b","y","y","g","g","g","g","g","y","y","b","b","b","b","b","b","b"]
[null,"Kale","y","y","g","g","g","g","g","g","b","b","b","b","b","b","y","y","y","g","g","g","g","g","g","y","y","b","b","b","b","b","b","b"]
[null,"Millet","b","b","b","b","b","b","b","g","g","g","g","g","g","g","g","g","g","g","g","b","b","b","b","b","b","b","b","b","b","b","b","b"]
[null,"Mustard","y","y","g","g","g","g","g","g","b","b","b","b","b","b","b","b","b","b","g","g","g","g","g","y","y","b","b","b","b","b","b","b"]
[null,"Oats","y","y","g","g","g","g","y","y","y","y","y","y","y","y","y","y","y","y","y","y","g","g","g","y","y","b","b","b","b","b","b","b"]
[null,"Pea, Field/Winter","b","b","g","g","g","g","g","g","g","b","b","b","b","b","b","b","b","b","g","g","g","g","y","b","b","b","b","b","b","b","b","b"]
[null,"Radish","b","b","y","y","y","y","y","y","y","y","y","y","y","y","y","y","y","y","g","g","g","g","g","y","y","b","b","b","b","b","b","b"]
[null,"Rapeseed","y","y","g","g","g","g","g","g","y","y","y","y","y","y","y","y","y","y","g","g","g","g","g","y","y","b","b","b","b","b","b","b"]
[null,"Rye, Winter/Cereal","b","b","b","b","b","b","b","b","b","b","b","b","b","b","b","b","b","b","y","y","g","g","g","g","g","g","g","g","g","y","y","b"]
[null,"Ryegrass, Annual","b","b","g","g","g","g","g","g","y","y","y","y","b","b","b","b","g","g","g","g","g","y","y","y","y","b","b","b","b","b","b","b"]
[null,"Sorghum, Forage","b","b","b","b","b","b","b","g","g","g","g","g","g","g","g","g","g","g","g","b","b","b","b","b","b","b","b","b","b","b","b","b"]
[null,"Sorghum-sudangrass","b","b","b","b","b","b","b","g","g","g","g","g","g","g","g","g","g","g","g","b","b","b","b","b","b","b","b","b","b","b","b","b"]
[null,"Sudangrass","b","b","b","b","b","b","b","g","g","g","g","g","g","g","g","g","g","g","g","b","b","b","b","b","b","b","b","b","b","b","b","b"]
[null,"Sunflower","b","b","b","b","b","g","g","g","g","g","g","g","g","g","g","g","g","g","g","y","y","y","b","b","b","b","b","b","b","b","b","b"]
[null,"Sunn Hemp","b","b","b","b","b","b","b","g","g","g","g","g","g","g","g","g","g","g","g","y","y","y","b","b","b","b","b","b","b","b","b","b"]
[null,"Teff","b","b","b","b","b","b","b","g","g","g","g","g","g","g","g","g","g","g","g","y","y","y","b","b","b","b","b","b","b","b","b","b"]
[null,"Triticale, Winter","b","b","b","b","b","b","b","b","b","b","b","b","b","b","b","b","b","b","y","y","g","g","g","g","g","g","g","g","g","y","y","b"]
[null,"Turnip","b","b","y","y","y","y","y","y","y","y","y","y","y","y","y","y","y","y","g","g","g","g","g","y","y","b","b","b","b","b","b","b"]
[null,"Vetch, Common","b","b","g","g","g","g","g","g","g","b","b","b","b","b","b","b","b","g","g","g","g","g","y","b","b","b","b","b","b","b","b","b"]
[null,"Vetch, Hairy","b","b","g","g","g","g","g","g","g","g","g","b","b","b","b","b","b","b","g","g","g","g","g","y","b","b","b","b","b","b","b","b"]
[null,"Wheat, Spring","y","y","g","g","g","g","y","y","y","b","b","b","b","b","b","b","b","b","y","y","g","g","g","y","y","b","b","b","b","b","b","b"]
[null,"Wheat, Winter","b","b","b","b","b","b","b","b","b","b","b","b","b","b","b","b","b","b","y","y","g","g","g","g","g","g","g","y","y","b","b","b"]
[]
[null,"Species","Central"]
[null,null,"March",null,"April",null,null,null,"May",null,null,null,"June",null,null,null,"July",null,null,null,"August",null,null,null,"September",null,null,null,"October",null,null,null,"November"]
[null,"Barley, Spring","y","y","g","g","g","g","y","y","y","b","b","b","b","b","b","b","b","b","y","y","g","g","g","y","y","b","b","b","b","b","b","b"]
[null,"Barley, Winter","b","b","b","b","b","b","b","b","b","b","b","b","b","b","b","b","b","b","y","y","g","g","g","y","y","b","b","b","b","b","b","b"]
[null,"Mungbeans","b","b","b","b","b","b","b","g","g","g","g","g","g","g","g","g","g","g","g","b","b","b","b","b","b","b","b","b","b","b","b","b"]
[null,"Buckwheat","b","b","b","b","b","b","b","g","g","g","g","g","g","g","g","g","g","g","g","g","g","g","g","b","b","b","b","b","b","b","b","b"]
[null,"Camelina, Winter","b","b","b","b","b","b","b","b","b","b","b","b","b","b","b","b","b","b","y","y","g","g","g","g","g","g","g","g","g","y","y","b"]
[null,"Clover, Berseem","b","b","y","g","g","g","g","g","g","b","b","b","b","b","b","b","b","b","g","g","g","g","y","b","b","b","b","b","b","b","b","b"]
[null,"Clover, Crimson","b","b","y","g","g","g","g","g","g","b","b","b","b","b","b","b","b","b","g","g","g","g","y","b","b","b","b","b","b","b","b","b"]
[null,"Clover, Red","y","y","g","g","g","g","g","g","g","b","b","b","b","b","b","b","b","b","g","g","g","g","g","y","b","b","b","b","b","b","b","b"]
[null,"Clover, White","y","y","g","g","g","g","g","g","g","b","b","b","b","b","b","b","b","b","g","g","g","g","g","y","b","b","b","b","b","b","b","b"]
[null,"Cowpea","b","b","b","b","b","b","b","g","g","g","g","g","g","g","g","g","g","g","g","b","b","b","b","b","b","b","b","b","b","b","b","b"]
[null,"Flax","y","y","g","g","g","g","g","g","y","y","b","b","b","b","b","b","y","y","g","g","g","g","g","y","y","b","b","b","b","b","b","b"]
[null,"Kale","y","y","g","g","g","g","g","g","b","b","b","b","b","b","y","y","y","g","g","g","g","g","g","y","y","b","b","b","b","b","b","b"]
[null,"Millet","b","b","b","b","b","b","b","g","g","g","g","g","g","g","g","g","g","g","g","b","b","b","b","b","b","b","b","b","b","b","b","b"]
[null,"Mustard","y","y","g","g","g","g","g","g","b","b","b","b","b","b","b","b","b","b","g","g","g","g","g","y","y","b","b","b","b","b","b","b"]
[null,"Oats","y","y","g","g","g","g","y","y","y","y","y","y","y","y","y","y","y","y","y","y","g","g","g","y","y","b","b","b","b","b","b","b"]
[null,"Pea, Field/Winter","b","b","g","g","g","g","g","g","g","b","b","b","b","b","b","b","b","b","g","g","g","g","y","b","b","b","b","b","b","b","b","b"]
[null,"Radish","b","b","y","y","y","y","y","y","y","y","y","y","y","y","y","y","y","y","g","g","g","g","g","y","y","b","b","b","b","b","b","b"]
[null,"Rapeseed","y","y","g","g","g","g","g","g","y","y","y","y","y","y","y","y","y","y","g","g","g","g","g","y","y","b","b","b","b","b","b","b"]
[null,"Rye, Winter/Cereal","b","b","b","b","b","b","b","b","b","b","b","b","b","b","b","b","b","b","y","y","g","g","g","g","g","g","g","g","g","y","y","b"]
[null,"Ryegrass, Annual","b","b","g","g","g","g","g","g","y","y","y","y","b","b","b","b","g","g","g","g","g","y","y","y","y","b","b","b","b","b","b","b"]
[null,"Sorghum, Forage","b","b","b","b","b","b","b","g","g","g","g","g","g","g","g","g","g","g","g","b","b","b","b","b","b","b","b","b","b","b","b","b"]
[null,"Sorghum-sudangrass","b","b","b","b","b","b","b","g","g","g","g","g","g","g","g","g","g","g","g","b","b","b","b","b","b","b","b","b","b","b","b","b"]
[null,"Sudangrass","b","b","b","b","b","b","b","g","g","g","g","g","g","g","g","g","g","g","g","b","b","b","b","b","b","b","b","b","b","b","b","b"]
[null,"Sunflower","b","b","b","b","b","g","g","g","g","g","g","g","g","g","g","g","g","g","g","y","y","y","b","b","b","b","b","b","b","b","b","b"]
[null,"Sunn Hemp","b","b","b","b","b","b","b","g","g","g","g","g","g","g","g","g","g","g","g","y","y","y","b","b","b","b","b","b","b","b","b","b"]
[null,"Teff","b","b","b","b","b","b","b","g","g","g","g","g","g","g","g","g","g","g","g","y","y","y","b","b","b","b","b","b","b","b","b","b"]
[null,"Triticale, Winter","b","b","b","b","b","b","b","b","b","b","b","b","b","b","b","b","b","b","y","y","g","g","g","g","g","g","g","g","g","y","y","b"]
[null,"Turnip","b","b","y","y","y","y","y","y","y","y","y","y","y","y","y","y","y","y","g","g","g","g","g","y","y","b","b","b","b","b","b","b"]
[null,"Vetch, Common","b","b","g","g","g","g","g","g","g","b","b","b","b","b","b","b","b","g","g","g","g","g","y","b","b","b","b","b","b","b","b","b"]
[null,"Vetch, Hairy","b","b","g","g","g","g","g","g","g","g","g","b","b","b","b","b","b","b","g","g","g","g","g","y","b","b","b","b","b","b","b","b"]
[null,"Wheat, Spring","y","y","g","g","g","g","y","y","y","b","b","b","b","b","b","b","b","b","y","y","g","g","g","y","y","b","b","b","b","b","b","b"]
[null,"Wheat, Winter","b","b","b","b","b","b","b","b","b","b","b","b","b","b","b","b","b","b","y","y","g","g","g","g","g","g","g","y","y","b","b","b"]
[]
[null,"Species","East Central"]
[null,null,"March",null,"April",null,null,null,"May",null,null,null,"June",null,null,null,"July",null,null,null,"August",null,null,null,"September",null,null,null,"October",null,null,null,"November"]
[null,"Barley, Spring","y","g","g","g","g","g","y","y","y","b","b","b","b","b","b","b","b","b","y","y","g","g","g","g","y","y","b","b","b","b","b","b"]
[null,"Barley, Winter","b","b","b","b","b","b","b","b","b","b","b","b","b","b","b","b","b","b","y","y","g","g","g","g","y","y","b","b","b","b","b","b"]
[null,"Mungbeans","b","b","b","b","b","b","b","g","g","g","g","g","g","g","g","g","g","g","g","b","b","b","b","b","b","b","b","b","b","b","b","b"]
[null,"Buckwheat","b","b","b","b","b","b","b","g","g","g","g","g","g","g","g","g","g","g","g","g","g","g","g","g","b","b","b","b","b","b","b","b"]
[null,"Camelina, Winter","b","b","b","b","b","b","b","b","b","b","b","b","b","b","b","b","b","b","y","y","g","g","g","g","g","g","g","g","g","y","y","b"]
[null,"Clover, Berseem","b","y","y","g","g","g","g","g","g","b","b","b","b","b","b","b","b","b","g","g","g","g","y","y","b","b","b","b","b","b","b","b"]
[null,"Clover, Crimson","b","y","y","g","g","g","g","g","g","b","b","b","b","b","b","b","b","b","g","g","g","g","y","y","b","b","b","b","b","b","b","b"]
[null,"Clover, Red","y","g","g","g","g","g","g","g","g","b","b","b","b","b","b","b","b","b","g","g","g","g","g","g","y","b","b","b","b","b","b","b"]
[null,"Clover, White","y","g","g","g","g","g","g","g","g","b","b","b","b","b","b","b","b","b","g","g","g","g","g","g","y","b","b","b","b","b","b","b"]
[null,"Cowpea","b","b","b","b","b","b","b","g","g","g","g","g","g","g","g","g","g","g","g","b","b","b","b","b","b","b","b","b","b","b","b","b"]
[null,"Flax","y","g","g","g","g","g","g","g","y","y","b","b","b","b","b","b","y","y","g","g","g","g","g","g","y","y","b","b","b","b","b","b"]
[null,"Kale","y","g","g","g","g","g","g","g","b","b","b","b","b","b","y","y","y","g","g","g","g","g","g","g","y","y","b","b","b","b","b","b"]
[null,"Millet","b","b","b","b","b","b","b","g","g","g","g","g","g","g","g","g","g","g","g","b","b","b","b","b","b","b","b","b","b","b","b","b"]
[null,"Mustard","y","g","g","g","g","g","g","g","b","b","b","b","b","b","b","b","b","b","g","g","g","g","g","g","y","y","b","b","b","b","b","b"]
[null,"Oats","y","g","g","g","g","g","y","y","y","y","y","y","y","y","y","y","y","y","y","y","g","g","g","g","y","y","b","b","b","b","b","b"]
[null,"Pea, Field/Winter","b","g","g","g","g","g","g","g","g","b","b","b","b","b","b","b","b","b","g","g","g","g","y","y","b","b","b","b","b","b","b","b"]
[null,"Radish","b","y","y","y","y","y","y","y","y","y","y","y","y","y","y","y","y","y","g","g","g","g","g","g","y","y","b","b","b","b","b","b"]
[null,"Rapeseed","y","g","g","g","g","g","g","g","y","y","y","y","y","y","y","y","y","y","g","g","g","g","g","g","y","y","b","b","b","b","b","b"]
[null,"Rye, Winter/Cereal","b","b","b","b","b","b","b","b","b","b","b","b","b","b","b","b","b","b","y","y","g","g","g","g","g","g","g","g","g","y","y","b"]
[null,"Ryegrass, Annual","b","g","g","g","g","g","g","g","y","y","y","y","b","b","b","b","g","g","g","g","g","y","y","y","y","y","b","b","b","b","b","b"]
[null,"Sorghum, Forage","b","b","b","b","b","b","b","g","g","g","g","g","g","g","g","g","g","g","g","b","b","b","b","b","b","b","b","b","b","b","b","b"]
[null,"Sorghum-sudangrass","b","b","b","b","b","b","b","g","g","g","g","g","g","g","g","g","g","g","g","b","b","b","b","b","b","b","b","b","b","b","b","b"]
[null,"Sudangrass","b","b","b","b","b","b","b","g","g","g","g","g","g","g","g","g","g","g","g","b","b","b","b","b","b","b","b","b","b","b","b","b"]
[null,"Sunflower","b","b","b","b","b","g","g","g","g","g","g","g","g","g","g","g","g","g","g","y","y","y","b","b","b","b","b","b","b","b","b","b"]
[null,"Sunn Hemp","b","b","b","b","b","b","b","g","g","g","g","g","g","g","g","g","g","g","g","y","y","y","b","b","b","b","b","b","b","b","b","b"]
[null,"Teff","b","b","b","b","b","b","b","g","g","g","g","g","g","g","g","g","g","g","g","y","y","y","b","b","b","b","b","b","b","b","b","b"]
[null,"Triticale, Winter","b","b","b","b","b","b","b","b","b","b","b","b","b","b","b","b","b","b","y","y","g","g","g","g","g","g","g","g","g","y","y","b"]
[null,"Turnip","b","y","y","y","y","y","y","y","y","y","y","y","y","y","y","y","y","y","g","g","g","g","g","g","y","y","b","b","b","b","b","b"]
[null,"Vetch, Common","b","g","g","g","g","g","g","g","g","b","b","b","b","b","b","b","b","g","g","g","g","g","y","y","b","b","b","b","b","b","b","b"]
[null,"Vetch, Hairy","b","g","g","g","g","g","g","g","g","g","b","b","b","b","b","b","b","b","g","g","g","g","g","g","y","b","b","b","b","b","b","b"]
[null,"Wheat, Spring","y","g","g","g","g","g","y","y","y","b","b","b","b","b","b","b","b","b","y","y","g","g","g","g","y","y","b","b","b","b","b","b"]
[null,"Wheat, Winter","b","b","b","b","b","b","b","b","b","b","b","b","b","b","b","b","b","b","y","y","g","g","g","g","g","g","g","y","y","b","b","b"]
[]
[null,"Species","Southwest"]
[null,null,"March",null,"April",null,null,null,"May",null,null,null,"June",null,null,null,"July",null,null,null,"August",null,null,null,"September",null,null,null,"October",null,null,null,"November"]
[null,"Barley, Spring","y","g","g","g","g","g","y","y","y","b","b","b","b","b","b","b","b","b","y","y","g","g","g","y","y","y","b","b","b","b","b","b"]
[null,"Barley, Winter","b","b","b","b","b","b","b","b","b","b","b","b","b","b","b","b","b","b","y","y","g","g","g","y","y","y","b","b","b","b","b","b"]
[null,"Mungbeans","b","b","b","b","b","b","b","g","g","g","g","g","g","g","g","g","g","g","g","b","b","b","b","b","b","b","b","b","b","b","b","b"]
[null,"Buckwheat","b","b","b","b","b","b","b","g","g","g","g","g","g","g","g","g","g","g","g","g","g","g","g","b","b","b","b","b","b","b","b","b"]
[null,"Camelina, Winter","b","b","b","b","b","b","b","b","b","b","b","b","b","b","b","b","b","b","y","y","g","g","g","g","g","g","g","g","g","g","y","b"]
[null,"Clover, Berseem","b","y","y","g","g","g","g","g","g","b","b","b","b","b","b","b","b","b","g","g","g","g","y","b","b","b","b","b","b","b","b","b"]
[null,"Clover, Crimson","b","y","y","g","g","g","g","g","g","b","b","b","b","b","b","b","b","b","g","g","g","g","y","b","b","b","b","b","b","b","b","b"]
[null,"Clover, Red","y","g","g","g","g","g","g","g","g","b","b","b","b","b","b","b","b","b","g","g","g","g","g","y","y","b","b","b","b","b","b","b"]
[null,"Clover, White","y","g","g","g","g","g","g","g","g","b","b","b","b","b","b","b","b","b","g","g","g","g","g","y","y","b","b","b","b","b","b","b"]
[null,"Cowpea","b","b","b","b","b","b","b","g","g","g","g","g","g","g","g","g","g","g","g","b","b","b","b","b","b","b","b","b","b","b","b","b"]
[null,"Flax","y","g","g","g","g","g","g","g","y","y","b","b","b","b","b","y","y","y","g","g","g","g","g","y","y","y","b","b","b","b","b","b"]
[null,"Kale","y","g","g","g","g","g","g","g","b","b","b","b","b","b","y","y","y","g","g","g","g","g","g","y","y","y","b","b","b","b","b","b"]
[null,"Millet","b","b","b","b","b","b","b","g","g","g","g","g","g","g","g","g","g","g","g","b","b","b","b","b","b","b","b","b","b","b","b","b"]
[null,"Mustard","y","g","g","g","g","g","g","g","b","b","b","b","b","b","b","b","b","b","g","g","g","g","g","y","y","y","b","b","b","b","b","b"]
[null,"Oats","y","g","g","g","g","g","y","y","y","y","y","y","y","y","y","y","y","y","y","y","g","g","g","y","y","y","b","b","b","b","b","b"]
[null,"Pea, Field/Winter","b","g","g","g","g","g","g","g","g","b","b","b","b","b","b","b","b","b","g","g","g","g","y","b","b","b","b","b","b","b","b","b"]
[null,"Radish","b","y","y","y","y","y","y","y","y","y","y","y","y","y","y","y","y","y","g","g","g","g","g","y","y","y","b","b","b","b","b","b"]
[null,"Rapeseed","y","g","g","g","g","g","g","g","y","y","y","y","y","y","y","y","y","y","g","g","g","g","g","y","y","y","b","b","b","b","b","b"]
[null,"Rye, Winter/Cereal","b","b","b","b","b","b","b","b","b","b","b","b","b","b","b","b","b","b","y","y","g","g","g","g","g","g","g","g","g","g","y","b"]
[null,"Ryegrass, Annual","b","g","g","g","g","g","g","g","y","y","y","y","b","b","b","b","g","g","g","g","g","y","y","y","y","y","b","b","b","b","b","b"]
[null,"Sorghum, Forage","b","b","b","b","b","b","b","g","g","g","g","g","g","g","g","g","g","g","g","b","b","b","b","b","b","b","b","b","b","b","b","b"]
[null,"Sorghum-sudangrass","b","b","b","b","b","b","b","g","g","g","g","g","g","g","g","g","g","g","g","b","b","b","b","b","b","b","b","b","b","b","b","b"]
[null,"Sudangrass","b","b","b","b","b","b","b","g","g","g","g","g","g","g","g","g","g","g","g","b","b","b","b","b","b","b","b","b","b","b","b","b"]
[null,"Sunflower","b","b","b","b","b","g","g","g","g","g","g","g","g","g","g","g","g","g","g","y","y","y","b","b","b","b","b","b","b","b","b","b"]
[null,"Sunn Hemp","b","b","b","b","b","b","b","g","g","g","g","g","g","g","g","g","g","g","g","y","y","y","b","b","b","b","b","b","b","b","b","b"]
[null,"Teff","b","b","b","b","b","b","b","g","g","g","g","g","g","g","g","g","g","g","g","y","y","y","b","b","b","b","b","b","b","b","b","b"]
[null,"Triticale, Winter","b","b","b","b","b","b","b","b","b","b","b","b","b","b","b","b","b","b","y","y","g","g","g","g","g","g","g","g","g","g","y","b"]
[null,"Turnip","b","y","y","y","y","y","y","y","y","y","y","y","y","y","y","y","y","y","g","g","g","g","g","y","y","y","b","b","b","b","b","b"]
[null,"Vetch, Common","b","g","g","g","g","g","g","g","g","b","b","b","b","b","b","b","b","g","g","g","g","g","y","b","b","b","b","b","b","b","b","b"]
[null,"Vetch, Hairy","b","g","g","g","g","g","g","g","g","g","b","b","b","b","b","b","b","b","g","g","g","g","g","y","y","b","b","b","b","b","b","b"]
[null,"Wheat, Spring","y","g","g","g","g","g","y","y","y","b","b","b","b","b","b","b","b","b","y","y","g","g","g","y","y","y","b","b","b","b","b","b"]
[null,"Wheat, Winter","b","b","b","b","b","b","b","b","b","b","b","b","b","b","b","b","b","b","y","y","g","g","g","g","g","g","g","g","y","y","b","b"]
[]
[null,"Species","South Central"]
[null,null,"March",null,"April",null,null,null,"May",null,null,null,"June",null,null,null,"July",null,null,null,"August",null,null,null,"September",null,null,null,"October",null,null,null,"November"]
[null,"Barley, Spring","y","g","g","g","g","g","y","y","y","b","b","b","b","b","b","b","b","b","y","y","g","g","g","g","y","y","b","b","b","b","b","b"]
[null,"Barley, Winter","b","b","b","b","b","b","b","b","b","b","b","b","b","b","b","b","b","b","y","y","g","g","g","g","y","y","b","b","b","b","b","b"]
[null,"Mungbeans","b","b","b","b","b","b","b","g","g","g","g","g","g","g","g","g","g","g","g","b","b","b","b","b","b","b","b","b","b","b","b","b"]
[null,"Buckwheat","b","b","b","b","b","b","b","g","g","g","g","g","g","g","g","g","g","g","g","g","g","g","g","g","b","b","b","b","b","b","b","b"]
[null,"Camelina, Winter","b","b","b","b","b","b","b","b","b","b","b","b","b","b","b","b","b","b","y","y","g","g","g","g","g","g","g","g","g","g","y","b"]
[null,"Clover, Berseem","b","y","y","g","g","g","g","g","g","b","b","b","b","b","b","b","b","b","g","g","g","g","y","y","b","b","b","b","b","b","b","b"]
[null,"Clover, Crimson","b","y","y","g","g","g","g","g","g","b","b","b","b","b","b","b","b","b","g","g","g","g","y","y","b","b","b","b","b","b","b","b"]
[null,"Clover, Red","y","g","g","g","g","g","g","g","g","b","b","b","b","b","b","b","b","b","g","g","g","g","g","g","y","b","b","b","b","b","b","b"]
[null,"Clover, White","y","g","g","g","g","g","g","g","g","b","b","b","b","b","b","b","b","b","g","g","g","g","g","g","y","b","b","b","b","b","b","b"]
[null,"Cowpea","b","b","b","b","b","b","b","g","g","g","g","g","g","g","g","g","g","g","g","b","b","b","b","b","b","b","b","b","b","b","b","b"]
[null,"Flax","y","g","g","g","g","g","g","g","y","y","b","b","b","b","b","b","y","y","g","g","g","g","g","g","y","y","b","b","b","b","b","b"]
[null,"Kale","y","g","g","g","g","g","g","g","b","b","b","b","b","b","y","y","y","g","g","g","g","g","g","g","y","y","b","b","b","b","b","b"]
[null,"Millet","b","b","b","b","b","b","b","g","g","g","g","g","g","g","g","g","g","g","g","b","b","b","b","b","b","b","b","b","b","b","b","b"]
[null,"Mustard","y","g","g","g","g","g","g","g","b","b","b","b","b","b","b","b","b","b","g","g","g","g","g","g","y","y","b","b","b","b","b","b"]
[null,"Oats","y","g","g","g","g","g","y","y","y","y","y","y","y","y","y","y","y","y","y","y","g","g","g","g","y","y","b","b","b","b","b","b"]
[null,"Pea, Field/Winter","b","g","g","g","g","g","g","g","g","b","b","b","b","b","b","b","b","b","g","g","g","g","y","y","b","b","b","b","b","b","b","b"]
[null,"Radish","b","y","y","y","y","y","y","y","y","y","y","y","y","y","y","y","y","y","g","g","g","g","g","g","y","y","b","b","b","b","b","b"]
[null,"Rapeseed","y","g","g","g","g","g","g","g","y","y","y","y","y","y","y","y","y","y","g","g","g","g","g","g","y","y","b","b","b","b","b","b"]
[null,"Rye, Winter/Cereal","b","b","b","b","b","b","b","b","b","b","b","b","b","b","b","b","b","b","y","y","g","g","g","g","g","g","g","g","g","g","y","b"]
[null,"Ryegrass, Annual","b","g","g","g","g","g","g","g","y","y","y","y","b","b","b","b","g","g","g","g","g","y","y","y","y","y","b","b","b","b","b","b"]
[null,"Sorghum, Forage","b","b","b","b","b","b","b","g","g","g","g","g","g","g","g","g","g","g","g","b","b","b","b","b","b","b","b","b","b","b","b","b"]
[null,"Sorghum-sudangrass","b","b","b","b","b","b","b","g","g","g","g","g","g","g","g","g","g","g","g","b","b","b","b","b","b","b","b","b","b","b","b","b"]
[null,"Sudangrass","b","b","b","b","b","b","b","g","g","g","g","g","g","g","g","g","g","g","g","b","b","b","b","b","b","b","b","b","b","b","b","b"]
[null,"Sunflower","b","b","b","b","b","g","g","g","g","g","g","g","g","g","g","g","g","g","g","y","y","y","b","b","b","b","b","b","b","b","b","b"]
[null,"Sunn Hemp","b","b","b","b","b","b","b","g","g","g","g","g","g","g","g","g","g","g","g","y","y","y","b","b","b","b","b","b","b","b","b","b"]
[null,"Teff","b","b","b","b","b","b","b","g","g","g","g","g","g","g","g","g","g","g","g","y","y","y","b","b","b","b","b","b","b","b","b","b"]
[null,"Triticale, Winter","b","b","b","b","b","b","b","b","b","b","b","b","b","b","b","b","b","b","y","y","g","g","g","g","g","g","g","g","g","g","y","b"]
[null,"Turnip","b","y","y","y","y","y","y","y","y","y","y","y","y","y","y","y","y","y","g","g","g","g","g","g","y","y","b","b","b","b","b","b"]
[null,"Vetch, Common","b","g","g","g","g","g","g","g","g","b","b","b","b","b","b","b","b","g","g","g","g","g","y","y","b","b","b","b","b","b","b","b"]
[null,"Vetch, Hairy","b","g","g","g","g","g","g","g","g","g","b","b","b","b","b","b","b","b","g","g","g","g","g","g","y","b","b","b","b","b","b","b"]
[null,"Wheat, Spring","y","g","g","g","g","g","y","y","y","b","b","b","b","b","b","b","b","b","y","y","g","g","g","g","y","y","b","b","b","b","b","b"]
[null,"Wheat, Winter","b","b","b","b","b","b","b","b","b","b","b","b","b","b","b","b","b","b","y","y","g","g","g","g","g","g","g","g","y","y","b","b"]
[]
[null,"Species","Southeast"]
[null,null,"March",null,"April",null,null,null,"May",null,null,null,"June",null,null,null,"July",null,null,null,"August",null,null,null,"September",null,null,null,"October",null,null,null,"November"]
[null,"Barley, Spring","y","g","g","g","g","y","y","y","y","b","b","b","b","b","b","b","b","b","y","y","g","g","g","g","y","y","y","b","b","b","b","b"]
[null,"Barley, Winter","b","b","b","b","b","b","b","b","b","b","b","b","b","b","b","b","b","b","y","y","g","g","g","g","y","y","y","b","b","b","b","b"]
[null,"Mungbeans","b","b","b","b","b","b","b","g","g","g","g","g","g","g","g","g","g","g","g","b","b","b","b","b","b","b","b","b","b","b","b","b"]
[null,"Buckwheat","b","b","b","b","b","b","b","g","g","g","g","g","g","g","g","g","g","g","g","g","g","g","g","g","b","b","b","b","b","b","b","b"]
[null,"Camelina, Winter","b","b","b","b","b","b","b","b","b","b","b","b","b","b","b","b","b","b","y","y","g","g","g","g","g","g","g","g","g","g","y","y"]
[null,"Clover, Berseem","b","y","y","g","g","g","g","g","g","b","b","b","b","b","b","b","b","b","g","g","g","g","y","y","b","b","b","b","b","b","b","b"]
[null,"Clover, Crimson","b","y","y","g","g","g","g","g","g","b","b","b","b","b","b","b","b","b","g","g","g","g","y","y","b","b","b","b","b","b","b","b"]
[null,"Clover, Red","y","g","g","g","g","g","g","g","g","b","b","b","b","b","b","b","b","b","g","g","g","g","g","g","y","b","b","b","b","b","b","b"]
[null,"Clover, White","y","g","g","g","g","g","g","g","g","b","b","b","b","b","b","b","b","b","g","g","g","g","g","g","y","b","b","b","b","b","b","b"]
[null,"Cowpea","b","b","b","b","b","b","b","g","g","g","g","g","g","g","g","g","g","g","g","b","b","b","b","b","b","b","b","b","b","b","b","b"]
[null,"Flax","y","g","g","g","g","g","g","g","y","y","b","b","b","b","b","b","y","y","g","g","g","g","g","g","y","y","y","b","b","b","b","b"]
[null,"Kale","y","g","g","g","g","g","g","g","b","b","b","b","b","b","y","y","y","g","g","g","g","g","g","g","y","y","y","b","b","b","b","b"]
[null,"Millet","b","b","b","b","b","b","b","g","g","g","g","g","g","g","g","g","g","g","g","b","b","b","b","b","b","b","b","b","b","b","b","b"]
[null,"Mustard","y","g","g","g","g","g","g","g","b","b","b","b","b","b","b","b","b","b","g","g","g","g","g","g","y","y","y","b","b","b","b","b"]
[null,"Oats","y","g","g","g","g","y","y","y","y","y","y","y","y","y","y","y","y","y","y","y","g","g","g","g","y","y","y","b","b","b","b","b"]
[null,"Pea, Field/Winter","b","g","g","g","g","g","g","g","g","b","b","b","b","b","b","b","b","b","g","g","g","g","y","y","b","b","b","b","b","b","b","b"]
[null,"Radish","b","y","y","y","y","y","y","y","y","y","y","y","y","y","y","y","y","y","g","g","g","g","g","g","y","y","y","b","b","b","b","b"]
[null,"Rapeseed","y","g","g","g","g","g","g","g","y","y","y","y","y","y","y","y","y","y","g","g","g","g","g","g","y","y","y","b","b","b","b","b"]
[null,"Rye, Winter/Cereal","b","b","b","b","b","b","b","b","b","b","b","b","b","b","b","b","b","b","y","y","g","g","g","g","g","g","g","g","g","g","y","y"]
[null,"Ryegrass, Annual","b","g","g","g","g","g","g","g","y","y","y","y","b","b","b","b","g","g","g","g","g","y","y","y","y","y","y","b","b","b","b","b"]
[null,"Sorghum, Forage","b","b","b","b","b","b","b","g","g","g","g","g","g","g","g","g","g","g","g","b","b","b","b","b","b","b","b","b","b","b","b","b"]
[null,"Sorghum-sudangrass","b","b","b","b","b","b","b","g","g","g","g","g","g","g","g","g","g","g","g","b","b","b","b","b","b","b","b","b","b","b","b","b"]
[null,"Sudangrass","b","b","b","b","b","b","b","g","g","g","g","g","g","g","g","g","g","g","g","b","b","b","b","b","b","b","b","b","b","b","b","b"]
[null,"Sunflower","b","b","b","b","g","g","g","g","g","g","g","g","g","g","g","g","g","g","g","y","y","y","b","b","b","b","b","b","b","b","b","b"]
[null,"Sunn Hemp","b","b","b","b","b","b","b","g","g","g","g","g","g","g","g","g","g","g","g","y","y","y","b","b","b","b","b","b","b","b","b","b"]
[null,"Teff","b","b","b","b","b","b","b","g","g","g","g","g","g","g","g","g","g","g","g","y","y","y","b","b","b","b","b","b","b","b","b","b"]
[null,"Triticale, Winter","b","b","b","b","b","b","b","b","b","b","b","b","b","b","b","b","b","b","y","y","g","g","g","g","g","g","g","g","g","g","y","y"]
[null,"Turnip","b","y","y","y","y","y","y","y","y","y","y","y","y","y","y","y","y","y","g","g","g","g","g","g","y","y","y","b","b","b","b","b"]
[null,"Vetch, Common","b","g","g","g","g","g","g","g","g","b","b","b","b","b","b","b","b","g","g","g","g","g","y","y","b","b","b","b","b","b","b","b"]
[null,"Vetch, Hairy","b","g","g","g","g","g","g","g","g","g","b","b","b","b","b","b","b","b","g","g","g","g","g","g","y","b","b","b","b","b","b","b"]
[null,"Wheat, Spring","y","g","g","g","g","y","y","y","y","b","b","b","b","b","b","b","b","b","y","y","g","g","g","g","y","y","y","b","b","b","b","b"]
[null,"Wheat, Winter","b","b","b","b","b","b","b","b","b","b","b","b","b","b","b","b","b","b","y","y","g","g","g","g","g","g","g","g","y","y","b","b"]