{"text_format":"1","workbook":"xlsx","n_sheets":10,"sheets":["Instructions","Design","Design Summary","Plan Map","IA-1571 Drawings","IA-1572 Drawings","Specs-O&M","Reference","Labels","Notes"],"not_rendered":{"charts":0,"images":15,"macros":1,"external_links":1,"defined_names":51,"comments":1,"pivot_tables":0},"unopened":[],"bounds":{"document_bytes":16777216,"sheet_cells":100000,"rows_first":2000,"rows_last":500,"rows_between":2000,"halvings":0,"cell_chars":16384,"cell_head_chars":4096},"cells_cut":0,"cells_raw":0,"read":"whole","date_system":"1900"}

{"sheet":"Instructions","index":0,"n_rows":47,"n_cols":27,"rows_kept":47,"cut":false,"hidden":false,"merged":[[43,18,43,19],[44,18,44,19],[45,18,45,19],[43,20,43,21],[44,20,44,21],[32,20,32,21],[2,2,2,11],[3,2,3,11],[6,0,6,11],[5,0,5,1],[32,15,32,17],[32,18,32,19],[14,2,14,11],[11,2,11,11],[7,0,11,1],[15,0,15,11],[7,2,7,11],[12,0,12,11],[32,13,36,14],[31,15,31,17],[16,2,21,11],[33,15,33,17],[34,15,34,17],[35,15,35,17],[36,15,36,17],[47,15,47,16],[44,15,44,17],[38,15,38,17],[39,15,39,17],[40,15,40,17],[41,15,41,17],[42,15,42,17],[43,15,43,17],[37,15,37,17],[45,15,45,17],[46,15,46,17],[33,18,33,19],[34,18,34,19],[35,18,35,19],[36,18,36,19],[37,18,37,19],[33,20,33,21],[34,20,34,21],[35,20,35,21],[36,20,36,21],[37,20,37,21],[40,20,40,21],[39,20,39,21],[45,20,45,21],[41,20,41,21],[37,13,40,14],[44,13,46,14],[41,13,43,14],[38,20,38,21],[46,20,46,21],[42,20,42,21],[46,18,46,19],[38,18,38,19],[39,18,39,19],[40,18,40,19],[41,18,41,19],[42,18,42,19],[46,0,46,11],[24,0,24,11],[25,2,30,11],[25,0,30,1],[39,0,39,11],[40,0,40,11],[38,0,38,11],[35,2,37,11],[35,0,37,1],[22,0,22,11],[23,0,23,1],[23,2,23,11],[32,0,33,1],[32,2,33,11],[0,12,0,26],[0,0,1,11],[4,0,4,11],[5,2,5,11],[31,20,31,21],[4,13,4,26],[19,13,19,26],[13,2,13,11],[16,0,21,1],[9,2,9,11],[13,0,14,1],[31,18,31,19],[31,13,31,14],[2,0,2,1],[3,0,3,1],[10,2,10,11]]}
["Iowa Roof Runoff Spreadsheet Design Tool",null,null,null,null,null,null,null,null,null,null,null,"Gutter and Downspoint Material Information"]
[]
["Step",null,"Instructions",null,null,null,null,null,null,null,null,null,null,"Gutter Sizes"]
[1,null,"Enter basic information -- designer, producer name, location"]
[null,null,null,null,null,null,null,null,null,null,null,null,null,"K-Style Gutter Sizes"]
[2,null,"Select the correct county from the drop down menu"]
[null,null,null,null,null,null,null,null,null,null,null,null,null,null,null,null,null,null,"INCH","A","B","C","D","E","F","G","Area (sq. in.)"]
[3,null,"Enter basic characteristics about the building, including the name, the area, the height of the downspouts, and",null,null,null,null,null,null,null,null,null,null,null,null,null,null,null,"5K",3.625,3.375,3.625,0.56200000000000006,5,0.56200000000000006,0.5,12.68]
[null,null,"gutter slope.  The Gutter Length is the linear feet of gutter that drains to a particular downspout section.",null,null,null,null,null,null,null,null,null,null,null,null,null,null,null,"6K",3.875,3.875,4.625,1,6,0.625,0.5625,20.23]
[null,null,"IMPORTANT: the roof area entered should be the roof area PER GUTTER SECTION.  So, if you have",null,null,null,null,null,null,null,null,null,null,null,null,null,null,null,"7K",5.875,4.5620000000000003,6,1,7,0.625,0.625,31.64]
{"$rows_left_out":38}
{"sheet":"Design","index":1,"n_rows":35,"n_cols":191,"rows_kept":35,"cut":false,"hidden":false,"merged":[[20,4,20,6],[19,8,19,10],[20,8,20,10],[19,12,19,14],[20,12,20,14],[20,0,20,2],[2,1,2,2],[3,3,3,6],[17,0,17,15],[7,1,7,2],[5,1,5,2],[4,1,4,2],[11,12,11,16],[3,1,3,2],[2,7,7,10],[2,12,7,15],[11,0,11,6],[11,7,11,11],[19,0,19,2],[6,1,6,2],[19,4,19,6]]}
["Roof Runoff Structure (Gutter Design) Conservation Practice Standard 558",null,null,null,null,null,null,null,null,null,null,null,null,null,null,null,"Iowa NRCS - Version 2.0  June 2023"]
[]
["Designed By:",null,null,null,null,null,null,"Note on K-Style Gutter Downspout Selection: \n5\" K-Style gutter can receive a 2\"x3\" downspout; \n6\" K-Style gutter can receive a 3\"x4\" downspout;\n7\" K-Style gutter can receive a 4\"x5\" downspout.  ",null,null,null,null,"Notes on gutter hydraulics:  \nCalculations in this spreadsheet use the 10 yr - 5 min or the \n             25 yr - 5min storm event (as selected by the user).  \nInput gutter slope in ft/ft.  Typical slope is 1/16\"/ft = 0.00521 ft/ft.\nManning's 'n' for the gutter is 0.012."]
["Designed By Date:"]
["Section:"]
["Township:"]
["Range:"]
["Producer Name:"]
["County:","25yr, 5min:",{"$f":"VLOOKUP(Reference!B107,Reference!$A$3:$D$104,3)","v":0.74}]
[null,"10yr, 5 min:",{"$f":"VLOOKUP(Reference!B107,Reference!$A$3:$D$104,4)","v":0.65},null,null,"Reference: Agricultural Waste Management Field Handbook, NEH Part 651 Chapter 10",null,null,null,null,null,null,null,null,null,null,null,null,null,null,null,null,null,null,null,{"$f":"IF(Reference!N39,6,0)","v":0}]
{"$rows_left_out":26}
{"sheet":"Design Summary","index":2,"n_rows":38,"n_cols":69,"rows_kept":38,"cut":false,"hidden":false,"merged":[[4,68,5,69],[4,10,5,13],[4,14,5,15],[4,32,5,33],[11,22,11,25],[11,58,11,61],[11,40,11,43],[5,41,5,42],[4,50,5,51],[12,65,12,69],[11,4,11,7],[18,2,18,15],[9,2,9,7],[9,9,9,15],[9,27,9,33],[9,45,9,51],[18,20,18,33],[9,38,9,43],[20,2,20,15],[27,2,27,15],[1,5,1,7],[1,8,1,11],[9,20,9,25],[3,2,3,7],[3,9,3,15],[6,10,6,11],[5,3,5,4],[6,3,6,4],[4,5,4,6],[5,5,5,6],[6,5,6,6],[20,20,20,33],[27,20,27,33],[1,23,1,25],[1,26,1,29],[3,20,3,25],[3,27,3,33],[4,23,4,24],[5,21,5,22],[5,23,5,24],[4,28,5,31],[20,38,20,51],[27,38,27,51],[20,56,20,69],[27,56,27,69],[1,41,1,43],[18,38,18,51],[18,56,18,69],[6,46,6,47],[9,63,9,69],[6,57,6,58],[6,59,6,60],[6,64,6,65],[9,56,9,61],[4,64,5,67],[4,46,5,49],[1,59,1,61],[1,62,1,65],[6,21,6,22],[6,23,6,24],[6,28,6,29],[6,39,6,40],[6,41,6,42],[3,56,3,61],[3,63,3,69],[4,59,4,60],[5,57,5,58],[5,59,5,60],[1,44,1,47],[3,38,3,43],[3,45,3,51],[4,41,4,42],[5,39,5,40]]}
[]
[null,null,null,null,null,"Gutter Name:",null,null,{"$f":"IF(ISBLANK(Design!A14),\"\",Design!A14)","v":""},null,null,null,null,null,null,null,null,null,null,null,null,null,null,"Gutter Name:",null,null,{"$f":"IF(ISBLANK(Design!A15),\"\",Design!A15)","v":""},null,null,null,null,null,null,null,null,null,null,null,null,null,null,"Gutter Name:",null,null,{"$f":"IF(ISBLANK(Design!A16),\"\",Design!A16)","v":""},null,null,null,null,null,null,null,null,null,null,null,null,null,null,"Gutter Name:",null,null,{"$f":"IF(ISBLANK(Design!A17),\"\",Design!A17)","v":""}]
[]
[null,null,"Roof Information",null,null,null,null,null,null,"Storm Event",null,null,null,null,null,null,null,null,null,null,"Roof Information",null,null,null,null,null,null,"Storm Event",null,null,null,null,null,null,null,null,null,null,"Roof Information",null,null,null,null,null,null,"Storm Event",null,null,null,null,null,null,null,null,null,null,"Roof Information",null,null,null,null,null,null,"Storm Event"]
[null,null,null,"Detail",null,"Amount",null,"Unit",null,null,{"$f":"IF(Reference!$L$46=1,Reference!$J$46,Reference!$J$47)&\" Storm:\"","v":"25-year, 5 minute Storm:"},null,null,null,{"$f":"IF(Reference!$L$46=1,Design!$C$10,Design!$C$9)","v":0.74},null,null,null,null,null,null,"Detail",null,"Amount",null,"Unit",null,null,{"$f":"IF(Reference!$L$47=1,Reference!$J$46,Reference!$J$47)&\" Storm:\"","v":"25-year, 5 minute Storm:"},null,null,null,{"$f":"IF(Reference!$L$47=1,Design!$C$10,Design!$C$9)","v":0.74},null,null,null,null,null,null,"Detail",null,"Amount",null,"Unit",null,null,{"$f":"IF(Reference!$L$48=1,Reference!$J$46,Reference!$J$47)&\" Storm:\"","v":"25-year, 5 minute Storm:"},null,null,null,{"$f":"IF(Reference!$L$48=1,Design!$C$10,Design!$C$9)","v":0.74},null,null,null,null,null,null,"Detail",null,"Amount",null,"Unit",null,null,{"$f":"IF(Reference!$L$49=1,Reference!$J$46,Reference!$J$47)&\" Storm:\"","v":"25-year, 5 minute Storm:"},null,null,null,{"$f":"IF(Reference!$L$49=1,Design!$C$10,Design!$C$9)","v":0.74}]
[null,null,null,"Roof Area",null,{"$f":"IF(ISBLANK(Design!$B$14),\"\",Design!$B$14)","v":""},null,"SQ. FT.",null,null,null,null,null,null,null,null,null,null,null,null,null,"Roof Area",null,{"$f":"IF(ISBLANK(Design!$B$15),\"\",Design!$B$15)","v":""},null,"SQ. FT.",null,null,null,null,null,null,null,null,null,null,null,null,null,"Roof Area",null,{"$f":"IF(ISBLANK(Design!$B$16),\"\",Design!$B$16)","v":""},null,"SQ. FT.",null,null,null,null,null,null,null,null,null,null,null,null,null,"Roof Area",null,{"$f":"IF(ISBLANK(Design!$B$17),\"\",Design!$B$17)","v":""},null,"SQ. FT."]
[null,null,null,"Gutter Length",null,{"$f":"IF(ISBLANK(Design!$C$14),\"\",Design!$C$14)","v":""},null,"FT.",null,null,"Roof Flow:",null,{"$f":"Design!$G$14","v":0},"C.F.S",null,null,null,null,null,null,null,"Gutter Length",null,{"$f":"IF(ISBLANK(Design!$C$15),\"\",Design!$C$15)","v":""},null,"FT.",null,null,"Roof Flow:",null,{"$f":"Design!$G$15","v":0},"C.F.S",null,null,null,null,null,null,null,"Gutter Length",null,{"$f":"IF(ISBLANK(Design!$C$16),\"\",Design!$C$16)","v":""},null,"FT.",null,null,"Roof Flow:",null,{"$f":"Design!$G$16","v":0},"C.F.S",null,null,null,null,null,null,null,"Gutter Length",null,{"$f":"IF(ISBLANK(Design!$C$17),\"\",Design!$C$17)","v":""},null,"FT.",null,null,"Roof Flow:",null,{"$f":"Design!$G$17","v":0},"C.F.S"]
[]
[]
[null,null,"Gutter Material Quantities",null,null,null,null,null,null,"Downspout Material Quantities",null,null,null,null,null,null,null,null,null,null,"Gutter Material Quantities",null,null,null,null,null,null,"Downspout Material Quantities",null,null,null,null,null,null,null,null,null,null,"Gutter Material Quantities",null,null,null,null,null,null,"Downspout Material Quantities",null,null,null,null,null,null,null,null,null,null,"Gutter Material Quantities",null,null,null,null,null,null,"Downspout Material Quantities"]
{"$rows_left_out":29}
{"sheet":"Plan Map","index":3,"n_rows":49,"n_cols":7,"rows_kept":49,"cut":false,"hidden":false,"merged":[]}
[]
[]
[]
[]
[]
[]
[]
[]
[]
[]
{"$rows_left_out":40}
{"sheet":"IA-1571 Drawings","index":4,"n_rows":0,"n_cols":0,"rows_kept":0,"cut":false,"hidden":false,"merged":[]}

{"sheet":"IA-1572 Drawings","index":5,"n_rows":0,"n_cols":0,"rows_kept":0,"cut":false,"hidden":false,"merged":[]}

{"sheet":"Specs-O&M","index":6,"n_rows":53,"n_cols":19,"rows_kept":53,"cut":false,"hidden":true,"merged":[[53,0,53,9],[44,0,44,9],[45,0,45,9],[46,0,46,9],[47,0,47,9],[48,0,48,9],[49,0,49,9],[42,0,42,9],[43,0,43,9],[50,0,50,9],[51,0,51,9],[52,0,52,9],[37,0,37,9],[38,0,38,9],[39,0,39,9],[40,0,40,9],[41,0,41,9],[32,0,32,9],[33,0,33,9],[34,0,34,9],[35,0,35,9],[36,0,36,9],[27,0,27,9],[28,0,28,9],[29,0,29,9],[30,0,30,9],[31,0,31,9],[22,0,22,9],[23,0,23,9],[24,0,24,9],[25,0,25,9],[26,0,26,9],[17,0,17,9],[18,0,18,9],[19,0,19,9],[20,0,20,9],[21,0,21,9],[12,0,12,9],[13,0,13,9],[14,0,14,9],[15,0,15,9],[16,0,16,9],[7,0,7,9],[8,0,8,9],[9,0,9,9],[10,0,10,9],[11,0,11,9],[0,0,0,9],[3,0,3,9],[4,0,4,9],[5,0,5,9],[6,0,6,9],[37,10,37,19],[38,10,38,19],[39,10,39,19],[40,10,40,19],[41,10,41,19]]}
[]
[]
[]
[]
[]
[]
[]
[]
[]
[]
{"$rows_left_out":44}
{"sheet":"Reference","index":7,"n_rows":109,"n_cols":31,"rows_kept":109,"cut":false,"hidden":false,"merged":[[30,16,30,18],[24,16,24,17],[14,16,14,17],[15,16,15,17],[16,16,16,17],[17,16,17,17],[18,16,18,17],[0,1,0,3],[15,14,15,15],[16,14,16,15],[17,14,17,15],[18,14,18,15],[14,14,14,15]]}
[null,"NOAA Atlas 14 Rainfall Data",null,null,null,null,null,null,null,null,null,null,null,null,null,null,null,null,null,null,null,null,null,null,null,null,null,null,null,null,"These numbers are as harvested from NOAA (not rounded off)"]
[null,"County","Rainfall 25yr, 5min, in","Rainfall 10yr, 5 min, in",null,null,null,null,null,null,null,null,null,null,null,null,null,null,null,null,null,null,null,null,null,null,null,null,null,"Rainfall 25yr, 5min, in","Rainfall 10yr, 5 min, in"]
[1,"ADAIR",{"$f":"ROUND(AD3,2)","v":0.74},{"$f":"ROUND(AE3,2)","v":0.65},"Note: Area and wetted perimeter numbers based on calculations by Matt Robert 7/2/13",null,null,null,null,null,null,"Manning's n",null,null,"JOB CLASS",1,null,null,null,null,null,null,null,null,null,null,null,null,null,0.73886473522600005,0.64697896453899995]
[{"$f":"A3+1","v":2},"ADAMS",{"$f":"ROUND(AD4,2)","v":0.74},0.66,"Gutters",null,null,null,null,"Qgutter, cfs (without s)",null,1.2E-2,null,1,"Job Class",null,null,null,null,null,null,null,null,null,null,null,null,null,null,0.73961697762599998,0.65777846880799995]
[{"$f":"A4+1","v":3},"ALLAMAKEE",0.73,0.64,1,null,"Area, in2","Wetted Per., in","r, in",null,"Depth, in",null,null,2,"I",null,null,null,null,null,null,null,null,null,null,null,null,null,null,0.73226411745099995,0.64107419736000004]
[4,"APPANOOSE",0.7,0.61,2,"5\" K-Style ",12.68,10.11,{"$f":"G6/H6","v":1.2542037586547972},{"$f":"(1.486/$L$4)*(G6/144)*((I6/12)^(2/3))","v":2.4194624862595044},3.625,null,null,3,"II",null,null,null,null,null,null,null,null,null,null,null,null,null,null,0.69873344778799995,0.61357491284300003]
[5,"AUDUBON",0.73,0.64,3,"6\" K-Style ",20.23,12.8,1.5804687499999999,{"$f":"(1.486/$L$4)*(G7/144)*((I7/12)^(2/3))","v":4.5034021632567001},4.625,null,null,4,"III",null,null,null,null,null,null,null,null,null,null,null,null,null,null,0.73417085319300002,0.64273366441900004]
[6,"BENTON ",0.74,0.64,4,"7\" K-Style ",31.64,16.2,1.9530864197530866,8.1109493413424829,6,null,null,5,"IV",null,null,null,null,null,null,null,null,null,null,null,null,null,null,0.73850698577499996,0.64112945633899998]
[7,"BLACK HAWK",0.72,0.63,5,"8\" K-Style",43.3,18.98,2.2799999999999998,12.306428560500349,7,null,null,6,"V",null,null,null,null,null,null,null,null,null,null,null,null,null,null,0.72186294066400003,0.62953651558699997]
[8,"BOONE",0.75,0.65,6,"4\" Half-Round",4.28,5.3,0.8075471698113208,0.60894295334536652,2,null,null,null,null,null,null,null,null,null,null,null,null,null,null,null,null,null,null,0.74987117526000002,0.64711246054899996]
{"$rows_left_out":100}
{"sheet":"Labels","index":8,"n_rows":36,"n_cols":10,"rows_kept":36,"cut":false,"hidden":true,"merged":[]}
["IA-1572:","Design 1 ","Design 2","Design 3","Design 4","IA-1571:","Design 1 ","Design 2","Design 3","Design 4"]
["Item","Quantity","Quantity","Quantity","Quantity",null,"Quantity","Quantity","Quantity","Quantity"]
["Gutter Slope",{"$f":"IF(Reference!$J$39=1,\"\",IF(ISBLANK(Design!E14),\"\",(Design!E14*12)))","v":""},{"$f":"IF(Reference!$J$40=1,\"\",IF(ISBLANK(Design!E15),\"\",(Design!E15*12)))","v":""},{"$f":"IF(Reference!$J$41=1,\"\",IF(ISBLANK(Design!E16),\"\",(Design!E16*12)))","v":""},{"$f":"IF(Reference!$J$42=1,\"\",IF(ISBLANK(Design!E17),\"\",(Design!E17*12)))","v":""},null,{"$f":"IF(Reference!$J$39=2,\"\",IF(ISBLANK(Design!E14),\"\",(Design!E14*12)))","v":""},{"$f":"IF(Reference!$J$40=2,\"\",IF(ISBLANK(Design!E15),\"\",(Design!E15*12)))","v":""},{"$f":"IF(Reference!$J$41=2,\"\",IF(ISBLANK(Design!E16),\"\",(Design!E16*12)))","v":""},{"$f":"IF(Reference!$J$42=2,\"\",IF(ISBLANK(Design!E17),\"\",(Design!E17*12)))","v":""}]
["Elbow Elevation",{"$f":"IF(Reference!$J$39=1,\"\",IF(ISBLANK(Design!$C$27),\"\",Design!$C$27))","v":""},{"$f":"IF(Reference!$J$40=1,\"\",IF(ISBLANK(Design!$G$27),\"\",Design!$G$27))","v":""},{"$f":"IF(Reference!$J$41=1,\"\",IF(ISBLANK(Design!$K$27),\"\",Design!$K$27))","v":""},{"$f":"IF(Reference!$J$42=1,\"\",IF(ISBLANK(Design!$O$27),\"\",Design!$O$27))","v":""}]
["Outlet Elevation",{"$f":"IF(Reference!$J$39=1,\"\",IF(ISBLANK(Design!C28),\"\",Design!C28))","v":""},{"$f":"IF(Reference!$J$40=1,\"\",IF(ISBLANK(Design!G28),\"\",Design!G28))","v":""},{"$f":"IF(Reference!$J$41=1,\"\",IF(ISBLANK(Design!K28),\"\",Design!K28))","v":""},{"$f":"IF(Reference!$J$42=1,\"\",IF(ISBLANK(Design!O28),\"\",Design!O28))","v":""}]
["Diameter Riser Unit",{"$f":"IF(Reference!$J$39=1,\"\",IF(ISBLANK(Design!C29),\"\",Design!C29))","v":""},{"$f":"IF(Reference!$J$40=1,\"\",IF(ISBLANK(Design!G29),\"\",Design!G29))","v":""},{"$f":"IF(Reference!$J$41=1,\"\",IF(ISBLANK(Design!K29),\"\",Design!K29))","v":""},{"$f":"IF(Reference!$J$42=1,\"\",IF(ISBLANK(Design!O29),\"\",Design!O29))","v":""}]
["Height including elbow",{"$f":"IF(Reference!$J$39=1,\"\",IF(ISBLANK(Design!C30),\"\",Design!C30))","v":""},{"$f":"IF(Reference!$J$40=1,\"\",IF(ISBLANK(Design!G30),\"\",Design!G30))","v":""},{"$f":"IF(Reference!$J$41=1,\"\",IF(ISBLANK(Design!K30),\"\",Design!K30))","v":""},{"$f":"IF(Reference!$J$42=1,\"\",IF(ISBLANK(Design!O30),\"\",Design!O30))","v":""}]
["Height above ground",{"$f":"IF(Reference!$J$39=1,\"\",IF(ISBLANK(Design!C31),\"\",Design!C31))","v":""},{"$f":"IF(Reference!$J$40=1,\"\",IF(ISBLANK(Design!G31),\"\",Design!G31))","v":""},{"$f":"IF(Reference!$J$41=1,\"\",IF(ISBLANK(Design!K31),\"\",Design!K31))","v":""},{"$f":"IF(Reference!$J$42=1,\"\",IF(ISBLANK(Design!O31),\"\",Design!O31))","v":""}]
["Solid Riser Outlet Pipe",{"$f":"IF(Reference!$J$39=1,\"\",IF(ISBLANK(Design!C32),\"\",Design!C32))","v":""},{"$f":"IF(Reference!$J$40=1,\"\",IF(ISBLANK(Design!G32),\"\",Design!G32))","v":""},{"$f":"IF(Reference!$J$41=1,\"\",IF(ISBLANK(Design!K32),\"\",Design!K32))","v":""},{"$f":"IF(Reference!$J$42=1,\"\",IF(ISBLANK(Design!O32),\"\",Design!O32))","v":""}]
["Outlet Conduit Diameter",{"$f":"IF(Reference!$J$39=1,\"\",IF(ISBLANK(Design!C33),\"\",Design!C33))","v":""},{"$f":"IF(Reference!$J$40=1,\"\",IF(ISBLANK(Design!G33),\"\",Design!G33))","v":""},{"$f":"IF(Reference!$J$41=1,\"\",IF(ISBLANK(Design!K33),\"\",Design!K33))","v":""},{"$f":"IF(Reference!$J$42=1,\"\",IF(ISBLANK(Design!O33),\"\",Design!O33))","v":""}]
{"$rows_left_out":27}
{"sheet":"Notes","index":9,"n_rows":107,"n_cols":4,"rows_kept":107,"cut":false,"hidden":false,"merged":[[2,0,4,0],[9,0,12,0],[2,2,4,2],[9,2,12,2],[13,1,17,1],[2,1,4,1],[13,2,17,2],[26,0,35,0],[26,1,35,1],[26,2,35,2],[20,0,23,0],[20,1,23,1],[20,2,23,2],[24,0,25,0],[24,1,25,1],[24,2,25,2],[18,0,19,0],[5,2,8,2],[5,1,8,1],[13,0,17,0],[5,0,8,0],[9,1,12,1],[18,2,19,2],[18,1,19,1],[53,1,61,1],[53,0,61,0],[36,0,45,0],[36,2,45,2],[36,1,45,1],[46,1,52,1],[46,0,52,0]]}
["Date","Program Version Number","Modification Author","Notes"]
["2010-03-04",1.01,"S. Anderson/ S. Hobson","Program as received from R. Book on noted date"]
["2010-03-05",1.02,"C. Zurliene","changed downspout flow equation to take square root of head (per AWFM chpt 10, July 1996)"]
[null,null,null,"added cell for building length to calcualte gutter footage and hanger quantities"]
[null,null,null,"added change event to gutter drop-down to enable custom cells to clear when not in use"]
["2010-03-08",1.03,"C. Zurliene","revised the methodology to fill out standard sheets"]
[null,null,null,"included outlet design section"]
[null,null,null,"added dialog box to save upon exiting workbook"]
[null,null,null,"added cell for downspout height to calculate additional quantities"]
["3/2010",1.04,"C. Zurliene","created outlet sections for all four buildings"]
{"$rows_left_out":97}