{"text_format":"1","workbook":"xlsx","n_sheets":13,"sheets":["Cover","Survey","Low Grade","Mod Grade","Stable Bottom","Access","Manning's n","Instr.","Calc.","Draw LG","Draw MG","Draw SB","Draw AC"],"not_rendered":{"charts":6,"images":20,"macros":1,"external_links":1,"defined_names":20,"comments":7,"pivot_tables":0},"unopened":[],"bounds":{"document_bytes":16777216,"sheet_cells":100000,"rows_first":2000,"rows_last":500,"rows_between":2000,"halvings":0,"cell_chars":16384,"cell_head_chars":4096},"cells_cut":0,"cells_raw":0,"read":"whole","date_system":"1900"}

{"sheet":"Cover","index":0,"n_rows":53,"n_cols":19,"rows_kept":53,"cut":false,"hidden":false,"merged":[[39,0,49,0],[39,6,39,7],[41,2,41,5],[41,11,41,16],[42,12,42,16],[44,1,44,8],[44,11,44,16],[49,16,50,17],[46,5,46,7],[47,11,47,16],[48,2,48,5],[48,12,48,16],[32,10,32,17],[32,18,32,19],[33,10,33,17],[33,18,33,19],[45,12,45,16],[38,18,38,19],[34,10,34,17],[34,18,34,19],[35,10,35,17],[35,18,35,19],[38,10,38,17],[36,10,36,17],[36,18,36,19],[37,10,37,17],[37,18,37,19],[30,10,30,17],[30,18,30,19],[31,10,31,17],[31,18,31,19],[24,2,24,7],[24,10,25,19],[26,10,26,17],[26,18,26,19],[27,10,27,17],[27,18,27,19],[28,10,28,17],[28,18,28,19],[29,10,29,17],[28,2,28,3],[29,18,29,19],[29,2,29,3],[19,3,19,4],[19,5,19,17],[21,3,21,4],[21,5,21,11],[25,2,27,7],[12,1,12,19],[15,1,15,19],[17,3,17,4],[17,5,17,17],[6,2,6,18],[7,1,7,19],[9,1,9,19],[11,3,11,5],[28,4,28,7],[29,4,29,7],[42,2,42,5],[49,2,49,5],[45,5,45,7],[45,2,45,4],[34,2,34,5],[36,2,36,7],[32,1,32,8],[38,2,38,7],[37,2,37,7]]}
[]
[]
[]
[]
[]
[]
[null,null,"Natural Resources Conservation Service"]
[null,"U. S. DEPARTMENT OF AGRICULTURE"]
[]
[null,"IN COOPERATION WITH"]
[]
[null,null,null,null,null,null,"COUNTY CONSERVATION DISTRICT"]
[null,"PENNSYLVANIA"]
[]
[]
[null,"DETAIL PLANS FOR"]
[]
[null,null,null,"(PRACTICE)",null,"Animal Stream Crossing"]
[]
[null,null,null,"(COOPERATOR)"]
{"$rows_left_out":34}
{"sheet":"Survey","index":1,"n_rows":57,"n_cols":24,"rows_kept":57,"cut":false,"hidden":false,"merged":[]}
[]
[]
[]
[]
[]
[]
[]
[]
[]
[]
[]
[]
[]
[]
[]
[]
[]
[null,null,"Section Survey notes",null,null,null,"channel","Manning's",null,null,"Est.",null,null,null,null,"Profile Survey notes",null,null,null,"channel"]
[null,null,null,"Height of Instrument (ft):",null,null,"slope (%)","\"n\"",null,null,"Bankfull",null,null,null,null,null,null,null,null,"slope (%)"]
[null,null,null,null,null,null,null,0.03,null,"Depth",5,"ft.",null,null,null,"Height of Instrument (ft):",{"$f":"C20","v":0},null,null,{"$f":"SLOPE(P23:P57,O23:O57)*-100","v":{"$error":"#DIV/0!"}}]
{"$rows_left_out":38}
{"sheet":"Low Grade","index":2,"n_rows":58,"n_cols":12,"rows_kept":58,"cut":false,"hidden":false,"merged":[]}
[]
[]
[]
[]
[]
[]
[]
[]
[]
[]
[]
[]
[]
[]
[]
[]
[]
[null,null,"Type Of Crossing:",null,null,null,"Volume of stone"]
[null,null,"Low Gradient",null,null,null,null,"Interior Stone","in.","Yd3","Tons"]
[null,null,null,null,null,null,null,"MODIFIED 2A",4,{"$f":"(C32*(I20/12)*C39)/27","v":0},{"$f":"ROUNDUP((J20*1.5),1)","v":0},"Top"]
{"$rows_left_out":39}
{"sheet":"Mod Grade","index":3,"n_rows":57,"n_cols":12,"rows_kept":57,"cut":false,"hidden":false,"merged":[]}
[]
[]
[]
[]
[]
[]
[]
[]
[]
[]
[]
[]
[]
[]
[]
[]
[]
[null,null,"Type Of Crossing:",null,null,null,"Volume of stone"]
[null,null,"Moderate Gradient",null,null,null,null,"Interior Stone","in.","Yd3","Tons"]
[null,null,null,null,null,null,null,"MODIFIED 2A",4,{"$f":"(C32*(I20/12)*C39)/27","v":0},{"$f":"ROUNDUP((J20*1.5),1)","v":0},"Top"]
{"$rows_left_out":38}
{"sheet":"Stable Bottom","index":4,"n_rows":58,"n_cols":12,"rows_kept":58,"cut":false,"hidden":false,"merged":[]}
[]
[]
[]
[]
[]
[]
[]
[]
[]
[]
[]
[]
[]
[]
[]
[]
[]
[null,null,null,"Type Of Crossing:",null,null,"Volume of stone"]
[null,null,"Stable Bottom",null,null,null,null,"Interior Stone","in.","Yd3","Tons"]
[null,null,null,null,null,null,null,"AASHTO 57",4,{"$f":"((C32*(I20/12)*C39)+(C32*(I20/12)*C40))/27","v":0},{"$f":"ROUNDUP((J20*1.5),1)","v":0},"Top"]
{"$rows_left_out":39}
{"sheet":"Access","index":5,"n_rows":58,"n_cols":12,"rows_kept":58,"cut":false,"hidden":false,"merged":[]}
[]
[]
[]
[]
[]
[]
[]
[]
[]
[]
[]
[]
[]
[]
[]
[]
[]
[null,null,"Type Of Crossing:",null,null,null,"Volume of stone"]
[null,null,"Access Ramp",null,null,null,null,"Interior Stone","in.","Yd3","Tons"]
[null,null,null,null,null,null,null,"AASHTO 57",4,{"$f":"(C32*(I20/12)*C38)/27","v":0},{"$f":"ROUNDUP((J20*1.8),1)","v":0},"Top"]
{"$rows_left_out":39}
{"sheet":"Manning's n","index":6,"n_rows":50,"n_cols":9,"rows_kept":50,"cut":false,"hidden":false,"merged":[]}
["Non-Vegetatal channels1:",null,null,null,null,null,null,"Manning's \"n\""]
[null,"Wooden flumes--planed (no battens)",null,null,null,null,null,0.01,1.4E-2]
[null,"Wooden flumes--unplaned (no battens)",null,null,null,null,null,1.0999999999999999E-2,1.4999999999999999E-2]
[null,"Metal flumes--smooth",null,null,null,null,null,1.0999999999999999E-2,1.4999999999999999E-2]
[null,"Metal flumes--corrugated",null,null,null,null,null,2.1999999999999999E-2,0.03]
[null,"Vitrified clay tile",null,null,null,null,null,1.2E-2,1.7000000000000001E-2]
[null,"Concrete--finished",null,null,null,null,null,1.0999999999999999E-2,1.4E-2]
[null,"Concrete--unfinished",null,null,null,null,null,1.4999999999999999E-2,0.02]
[null,"Masonry--rubble",null,null,null,null,null,1.7000000000000001E-2,0.03]
[null,"Masonry--dry-rubble",null,null,null,null,null,2.5000000000000001E-2,3.5000000000000003E-2]
[]
["Earth channels subject to intermittent flow:"]
["Bare--unable to support vegetal growth or vegetal growth not permitted by farm operations"]
[null,"Straight and uniform",null,null,null,null,null,1.7000000000000001E-2,2.5000000000000001E-2]
[null,"Dreged (rough bed)",null,null,null,null,null,2.5000000000000001E-2,3.5000000000000003E-2]
[]
["Earth channels subject to continuous flow2:"]
["Canals and ditches with continuous flow or sufficiently frequent flow to keep"]
["vegetation from growing on the bed."]
["A.","Channels with unusually good alignment, relitively smooth"]
{"$rows_left_out":31}
{"sheet":"Instr.","index":7,"n_rows":52,"n_cols":6,"rows_kept":52,"cut":false,"hidden":false,"merged":[]}
[null,null,null,null,null,"General Instructions And Guidance"]
[null,null,null,"This spreadsheet does not cover slat crossings"]
[null,null,null,"see PA Standard Drawings #29 and #30"]
[null,null,"Macro buttons are available to switch between worksheets."]
[null,null,"Enter data in teal shaded areas as needed."]
[null,null,"Comments are added to give additional guidance."]
[]
[]
[]
[]
["(1","Complete a site survey including a profile along the stream, and a cross section where the"]
[null,"proposed animal crossing will be."]
["(2","Enter the data on the cover sheet in the teal colored blocks."]
["(3","Enter the survey data on the Survey Notes sheet:"]
[null,"a) Enter the instrument height."]
[null,"b) Enter the station, (Left side as negative station and right side as positive station, and the "]
[null,"center as zero) as looking up stream. "]
[null,"(Enter the stations in sequential order from lowest to highest or highest to lowest.)"]
[null,"c) Enter the foresight reading for the station."]
[null,"d) Do this for each station in the cross section and the stream profile."]
{"$rows_left_out":33}
{"sheet":"Calc.","index":8,"n_rows":37,"n_cols":12,"rows_kept":37,"cut":false,"hidden":false,"merged":[]}
[null,null,"Width",null,null,"Access",null,"OK",null,null,null,"Sheet Passwords can be seen on each sheet."]
[{"$f":"Survey!$K$21","v":0},{"$f":"IF(D37=2,A2,Survey!K21+(Survey!K21-INDEX(Survey!E23:E57,MATCH(MAX(Survey!D23:D57),Survey!D23:D57,0))))","v":{"$error":"#N/A"}},null,null,null,"Left Bank","Right Bank","Try Again?"]
[{"$f":"Survey!$K$21","v":0},{"$f":"B$2","v":{"$error":"#N/A"}},{"$f":"IF(Survey!$C$23-Survey!$C$24<0,1,-1)*(IF(ISNA(Survey!$E$24),0,IF(Survey!$E$23<Survey!$K$21,IF(Survey!$E$24<Survey!$K$21,((Survey!$C$24-Survey!$C$23)^2)^0.5,(((Survey!$K$21-Survey!$E$23)*(Survey!$C$24-Survey!$C$23)/(Survey!$E$24-Survey!$E$23))^2)^0.5),IF(Survey!$E$24<Survey!$K$21,(((Survey!$K$21-Survey!$E$24)*(Survey!$C$24-Survey!$C$23)/(Survey!$E$23-Survey!$E$24))^2)^0.5,0))))","v":0},{"$f":"IF(ISNA(Survey!E24),0,IF(Survey!E23<Survey!K$21,IF(Survey!E24<Survey!K$21,(Survey!K$21-(Survey!E23+Survey!E24)*0.5)*C3,(Survey!K$21-Survey!E23)*0.5*C3),IF(Survey!E24<Survey!K$21,(Survey!K$21-Survey!E24)*0.5*C3,0)))","v":0},{"$f":"IF(ISNA(Survey!E24),0,IF(Survey!E23<Survey!K$21,IF(Survey!E24<Survey!K$21,(C3^2+(Survey!E24-Survey!E23)^2)^0.5,(C3^2+(Survey!K$21-Survey!E23)^2)^0.5),IF(Survey!E24<Survey!K$21,(C3^2+(Survey!K$21-Survey!E24)^2)^0.5,0)))","v":0},{"$f":"IF(Survey!$C23<Access!$C$28,'Calc.'!C3,0)","v":0},{"$f":"IF(Survey!$C23>=Access!$C$28,'Calc.'!C3,0)","v":0}]
[{"$f":"Survey!$K$21","v":0},{"$error":"#N/A"},{"$f":"IF(Survey!C24-Survey!C25<0,1,-1)*(IF(ISNA(Survey!E25),0,IF(Survey!E24<Survey!K$21,IF(Survey!E25<Survey!K$21,((Survey!C25-Survey!C24)^2)^0.5,(((Survey!K$21-Survey!E24)*(Survey!C25-Survey!C24)/(Survey!E25-Survey!E24))^2)^0.5),IF(Survey!E25<Survey!K$21,(((Survey!K$21-Survey!E25)*(Survey!C25-Survey!C24)/(Survey!E24-Survey!E25))^2)^0.5,0))))","v":0},{"$f":"IF(ISNA(Survey!E25),0,IF(Survey!E24<Survey!K$21,IF(Survey!E25<Survey!K$21,(Survey!K$21-(Survey!E24+Survey!E25)*0.5)*C4,(Survey!K$21-Survey!E24)*0.5*C4),IF(Survey!E25<Survey!K$21,(Survey!K$21-Survey!E25)*0.5*C4,0)))","v":0},{"$f":"IF(ISNA(Survey!E25),0,IF(Survey!E24<Survey!K$21,IF(Survey!E25<Survey!K$21,(C4^2+(Survey!E25-Survey!E24)^2)^0.5,(C4^2+(Survey!K$21-Survey!E24)^2)^0.5),IF(Survey!E25<Survey!K$21,(C4^2+(Survey!K$21-Survey!E25)^2)^0.5,0)))","v":0},{"$f":"IF(Survey!$C24<Access!$C$28,'Calc.'!C4,0)","v":0},{"$f":"IF(Survey!$C24>=Access!$C$28,'Calc.'!C4,0)","v":0},null,null,"GABIONS"]
[{"$f":"Survey!$K$21","v":0},{"$error":"#N/A"},{"$f":"IF(Survey!C25-Survey!C26<0,1,-1)*(IF(ISNA(Survey!E26),0,IF(Survey!E25<Survey!K$21,IF(Survey!E26<Survey!K$21,((Survey!C26-Survey!C25)^2)^0.5,(((Survey!K$21-Survey!E25)*(Survey!C26-Survey!C25)/(Survey!E26-Survey!E25))^2)^0.5),IF(Survey!E26<Survey!K$21,(((Survey!K$21-Survey!E26)*(Survey!C26-Survey!C25)/(Survey!E25-Survey!E26))^2)^0.5,0))))","v":0},{"$f":"IF(ISNA(Survey!E26),0,IF(Survey!E25<Survey!K$21,IF(Survey!E26<Survey!K$21,(Survey!K$21-(Survey!E25+Survey!E26)*0.5)*C5,(Survey!K$21-Survey!E25)*0.5*C5),IF(Survey!E26<Survey!K$21,(Survey!K$21-Survey!E26)*0.5*C5,0)))","v":0},{"$f":"IF(ISNA(Survey!E26),0,IF(Survey!E25<Survey!K$21,IF(Survey!E26<Survey!K$21,(C5^2+(Survey!E26-Survey!E25)^2)^0.5,(C5^2+(Survey!K$21-Survey!E25)^2)^0.5),IF(Survey!E26<Survey!K$21,(C5^2+(Survey!K$21-Survey!E26)^2)^0.5,0)))","v":0},{"$f":"IF(Survey!$C25<Access!$C$28,'Calc.'!C5,0)","v":0},{"$f":"IF(Survey!$C25>=Access!$C$28,'Calc.'!C5,0)","v":0},"R-3",null,"AASHTO #1"]
[{"$f":"Survey!$K$21","v":0},{"$error":"#N/A"},{"$f":"IF(Survey!C26-Survey!C27<0,1,-1)*(IF(ISNA(Survey!E27),0,IF(Survey!E26<Survey!K$21,IF(Survey!E27<Survey!K$21,((Survey!C27-Survey!C26)^2)^0.5,(((Survey!K$21-Survey!E26)*(Survey!C27-Survey!C26)/(Survey!E27-Survey!E26))^2)^0.5),IF(Survey!E27<Survey!K$21,(((Survey!K$21-Survey!E27)*(Survey!C27-Survey!C26)/(Survey!E26-Survey!E27))^2)^0.5,0))))","v":0},{"$f":"IF(ISNA(Survey!E27),0,IF(Survey!E26<Survey!K$21,IF(Survey!E27<Survey!K$21,(Survey!K$21-(Survey!E26+Survey!E27)*0.5)*C6,(Survey!K$21-Survey!E26)*0.5*C6),IF(Survey!E27<Survey!K$21,(Survey!K$21-Survey!E27)*0.5*C6,0)))","v":0},{"$f":"IF(ISNA(Survey!E27),0,IF(Survey!E26<Survey!K$21,IF(Survey!E27<Survey!K$21,(C6^2+(Survey!E27-Survey!E26)^2)^0.5,(C6^2+(Survey!K$21-Survey!E26)^2)^0.5),IF(Survey!E27<Survey!K$21,(C6^2+(Survey!K$21-Survey!E27)^2)^0.5,0)))","v":0},{"$f":"IF(Survey!$C26<Access!$C$28,'Calc.'!C6,0)","v":0},{"$f":"IF(Survey!$C26>=Access!$C$28,'Calc.'!C6,0)","v":0},"R-4"]
[{"$f":"Survey!$K$21","v":0},{"$error":"#N/A"},{"$f":"IF(Survey!C27-Survey!C28<0,1,-1)*(IF(ISNA(Survey!E28),0,IF(Survey!E27<Survey!K$21,IF(Survey!E28<Survey!K$21,((Survey!C28-Survey!C27)^2)^0.5,(((Survey!K$21-Survey!E27)*(Survey!C28-Survey!C27)/(Survey!E28-Survey!E27))^2)^0.5),IF(Survey!E28<Survey!K$21,(((Survey!K$21-Survey!E28)*(Survey!C28-Survey!C27)/(Survey!E27-Survey!E28))^2)^0.5,0))))","v":0},{"$f":"IF(ISNA(Survey!E28),0,IF(Survey!E27<Survey!K$21,IF(Survey!E28<Survey!K$21,(Survey!K$21-(Survey!E27+Survey!E28)*0.5)*C7,(Survey!K$21-Survey!E27)*0.5*C7),IF(Survey!E28<Survey!K$21,(Survey!K$21-Survey!E28)*0.5*C7,0)))","v":0},{"$f":"IF(ISNA(Survey!E28),0,IF(Survey!E27<Survey!K$21,IF(Survey!E28<Survey!K$21,(C7^2+(Survey!E28-Survey!E27)^2)^0.5,(C7^2+(Survey!K$21-Survey!E27)^2)^0.5),IF(Survey!E28<Survey!K$21,(C7^2+(Survey!K$21-Survey!E28)^2)^0.5,0)))","v":0},{"$f":"IF(Survey!$C27<Access!$C$28,'Calc.'!C7,0)","v":0},{"$f":"IF(Survey!$C27>=Access!$C$28,'Calc.'!C7,0)","v":0},"R-5",null,"AASHTO 57"]
[{"$f":"Survey!$K$21","v":0},{"$error":"#N/A"},{"$f":"IF(Survey!C28-Survey!C29<0,1,-1)*(IF(ISNA(Survey!E29),0,IF(Survey!E28<Survey!K$21,IF(Survey!E29<Survey!K$21,((Survey!C29-Survey!C28)^2)^0.5,(((Survey!K$21-Survey!E28)*(Survey!C29-Survey!C28)/(Survey!E29-Survey!E28))^2)^0.5),IF(Survey!E29<Survey!K$21,(((Survey!K$21-Survey!E29)*(Survey!C29-Survey!C28)/(Survey!E28-Survey!E29))^2)^0.5,0))))","v":0},{"$f":"IF(ISNA(Survey!E29),0,IF(Survey!E28<Survey!K$21,IF(Survey!E29<Survey!K$21,(Survey!K$21-(Survey!E28+Survey!E29)*0.5)*C8,(Survey!K$21-Survey!E28)*0.5*C8),IF(Survey!E29<Survey!K$21,(Survey!K$21-Survey!E29)*0.5*C8,0)))","v":0},{"$f":"IF(ISNA(Survey!E29),0,IF(Survey!E28<Survey!K$21,IF(Survey!E29<Survey!K$21,(C8^2+(Survey!E29-Survey!E28)^2)^0.5,(C8^2+(Survey!K$21-Survey!E28)^2)^0.5),IF(Survey!E29<Survey!K$21,(C8^2+(Survey!K$21-Survey!E29)^2)^0.5,0)))","v":0},{"$f":"IF(Survey!$C28<Access!$C$28,'Calc.'!C8,0)","v":0},{"$f":"IF(Survey!$C28>=Access!$C$28,'Calc.'!C8,0)","v":0},"R-6",null,"MODIFIED 2A"]
[{"$f":"Survey!$K$21","v":0},{"$error":"#N/A"},{"$f":"IF(Survey!C29-Survey!C30<0,1,-1)*(IF(ISNA(Survey!E30),0,IF(Survey!E29<Survey!K$21,IF(Survey!E30<Survey!K$21,((Survey!C30-Survey!C29)^2)^0.5,(((Survey!K$21-Survey!E29)*(Survey!C30-Survey!C29)/(Survey!E30-Survey!E29))^2)^0.5),IF(Survey!E30<Survey!K$21,(((Survey!K$21-Survey!E30)*(Survey!C30-Survey!C29)/(Survey!E29-Survey!E30))^2)^0.5,0))))","v":0},{"$f":"IF(ISNA(Survey!E30),0,IF(Survey!E29<Survey!K$21,IF(Survey!E30<Survey!K$21,(Survey!K$21-(Survey!E29+Survey!E30)*0.5)*C9,(Survey!K$21-Survey!E29)*0.5*C9),IF(Survey!E30<Survey!K$21,(Survey!K$21-Survey!E30)*0.5*C9,0)))","v":0},{"$f":"IF(ISNA(Survey!E30),0,IF(Survey!E29<Survey!K$21,IF(Survey!E30<Survey!K$21,(C9^2+(Survey!E30-Survey!E29)^2)^0.5,(C9^2+(Survey!K$21-Survey!E29)^2)^0.5),IF(Survey!E30<Survey!K$21,(C9^2+(Survey!K$21-Survey!E30)^2)^0.5,0)))","v":0},{"$f":"IF(Survey!$C29<Access!$C$28,'Calc.'!C9,0)","v":0},{"$f":"IF(Survey!$C29>=Access!$C$28,'Calc.'!C9,0)","v":0},"R-7"]
[{"$f":"Survey!$K$21","v":0},{"$error":"#N/A"},{"$f":"IF(Survey!C30-Survey!C31<0,1,-1)*(IF(ISNA(Survey!E31),0,IF(Survey!E30<Survey!K$21,IF(Survey!E31<Survey!K$21,((Survey!C31-Survey!C30)^2)^0.5,(((Survey!K$21-Survey!E30)*(Survey!C31-Survey!C30)/(Survey!E31-Survey!E30))^2)^0.5),IF(Survey!E31<Survey!K$21,(((Survey!K$21-Survey!E31)*(Survey!C31-Survey!C30)/(Survey!E30-Survey!E31))^2)^0.5,0))))","v":0},{"$f":"IF(ISNA(Survey!E31),0,IF(Survey!E30<Survey!K$21,IF(Survey!E31<Survey!K$21,(Survey!K$21-(Survey!E30+Survey!E31)*0.5)*C10,(Survey!K$21-Survey!E30)*0.5*C10),IF(Survey!E31<Survey!K$21,(Survey!K$21-Survey!E31)*0.5*C10,0)))","v":0},{"$f":"IF(ISNA(Survey!E31),0,IF(Survey!E30<Survey!K$21,IF(Survey!E31<Survey!K$21,(C10^2+(Survey!E31-Survey!E30)^2)^0.5,(C10^2+(Survey!K$21-Survey!E30)^2)^0.5),IF(Survey!E31<Survey!K$21,(C10^2+(Survey!K$21-Survey!E31)^2)^0.5,0)))","v":0},{"$f":"IF(Survey!$C30<Access!$C$28,'Calc.'!C10,0)","v":0},{"$f":"IF(Survey!$C30>=Access!$C$28,'Calc.'!C10,0)","v":0},"R-8"]
[{"$f":"Survey!$K$21","v":0},{"$error":"#N/A"},{"$f":"IF(Survey!C31-Survey!C32<0,1,-1)*(IF(ISNA(Survey!E32),0,IF(Survey!E31<Survey!K$21,IF(Survey!E32<Survey!K$21,((Survey!C32-Survey!C31)^2)^0.5,(((Survey!K$21-Survey!E31)*(Survey!C32-Survey!C31)/(Survey!E32-Survey!E31))^2)^0.5),IF(Survey!E32<Survey!K$21,(((Survey!K$21-Survey!E32)*(Survey!C32-Survey!C31)/(Survey!E31-Survey!E32))^2)^0.5,0))))","v":0},{"$f":"IF(ISNA(Survey!E32),0,IF(Survey!E31<Survey!K$21,IF(Survey!E32<Survey!K$21,(Survey!K$21-(Survey!E31+Survey!E32)*0.5)*C11,(Survey!K$21-Survey!E31)*0.5*C11),IF(Survey!E32<Survey!K$21,(Survey!K$21-Survey!E32)*0.5*C11,0)))","v":0},{"$f":"IF(ISNA(Survey!E32),0,IF(Survey!E31<Survey!K$21,IF(Survey!E32<Survey!K$21,(C11^2+(Survey!E32-Survey!E31)^2)^0.5,(C11^2+(Survey!K$21-Survey!E31)^2)^0.5),IF(Survey!E32<Survey!K$21,(C11^2+(Survey!K$21-Survey!E32)^2)^0.5,0)))","v":0},{"$f":"IF(Survey!$C31<Access!$C$28,'Calc.'!C11,0)","v":0},{"$f":"IF(Survey!$C31>=Access!$C$28,'Calc.'!C11,0)","v":0}]
[{"$f":"Survey!$K$21","v":0},{"$error":"#N/A"},{"$f":"IF(Survey!C32-Survey!C33<0,1,-1)*(IF(ISNA(Survey!E33),0,IF(Survey!E32<Survey!K$21,IF(Survey!E33<Survey!K$21,((Survey!C33-Survey!C32)^2)^0.5,(((Survey!K$21-Survey!E32)*(Survey!C33-Survey!C32)/(Survey!E33-Survey!E32))^2)^0.5),IF(Survey!E33<Survey!K$21,(((Survey!K$21-Survey!E33)*(Survey!C33-Survey!C32)/(Survey!E32-Survey!E33))^2)^0.5,0))))","v":0},{"$f":"IF(ISNA(Survey!E33),0,IF(Survey!E32<Survey!K$21,IF(Survey!E33<Survey!K$21,(Survey!K$21-(Survey!E32+Survey!E33)*0.5)*C12,(Survey!K$21-Survey!E32)*0.5*C12),IF(Survey!E33<Survey!K$21,(Survey!K$21-Survey!E33)*0.5*C12,0)))","v":0},{"$f":"IF(ISNA(Survey!E33),0,IF(Survey!E32<Survey!K$21,IF(Survey!E33<Survey!K$21,(C12^2+(Survey!E33-Survey!E32)^2)^0.5,(C12^2+(Survey!K$21-Survey!E32)^2)^0.5),IF(Survey!E33<Survey!K$21,(C12^2+(Survey!K$21-Survey!E33)^2)^0.5,0)))","v":0},{"$f":"IF(Survey!$C32<Access!$C$28,'Calc.'!C12,0)","v":0},{"$f":"IF(Survey!$C32>=Access!$C$28,'Calc.'!C12,0)","v":0}]
[{"$f":"Survey!$K$21","v":0},{"$error":"#N/A"},{"$f":"IF(Survey!C33-Survey!C34<0,1,-1)*(IF(ISNA(Survey!E34),0,IF(Survey!E33<Survey!K$21,IF(Survey!E34<Survey!K$21,((Survey!C34-Survey!C33)^2)^0.5,(((Survey!K$21-Survey!E33)*(Survey!C34-Survey!C33)/(Survey!E34-Survey!E33))^2)^0.5),IF(Survey!E34<Survey!K$21,(((Survey!K$21-Survey!E34)*(Survey!C34-Survey!C33)/(Survey!E33-Survey!E34))^2)^0.5,0))))","v":0},{"$f":"IF(ISNA(Survey!E34),0,IF(Survey!E33<Survey!K$21,IF(Survey!E34<Survey!K$21,(Survey!K$21-(Survey!E33+Survey!E34)*0.5)*C13,(Survey!K$21-Survey!E33)*0.5*C13),IF(Survey!E34<Survey!K$21,(Survey!K$21-Survey!E34)*0.5*C13,0)))","v":0},{"$f":"IF(ISNA(Survey!E34),0,IF(Survey!E33<Survey!K$21,IF(Survey!E34<Survey!K$21,(C13^2+(Survey!E34-Survey!E33)^2)^0.5,(C13^2+(Survey!K$21-Survey!E33)^2)^0.5),IF(Survey!E34<Survey!K$21,(C13^2+(Survey!K$21-Survey!E34)^2)^0.5,0)))","v":0},{"$f":"IF(Survey!$C33<Access!$C$28,'Calc.'!C13,0)","v":0},{"$f":"IF(Survey!$C33>=Access!$C$28,'Calc.'!C13,0)","v":0}]
[{"$f":"Survey!$K$21","v":0},{"$error":"#N/A"},{"$f":"IF(Survey!C34-Survey!C35<0,1,-1)*(IF(ISNA(Survey!E35),0,IF(Survey!E34<Survey!K$21,IF(Survey!E35<Survey!K$21,((Survey!C35-Survey!C34)^2)^0.5,(((Survey!K$21-Survey!E34)*(Survey!C35-Survey!C34)/(Survey!E35-Survey!E34))^2)^0.5),IF(Survey!E35<Survey!K$21,(((Survey!K$21-Survey!E35)*(Survey!C35-Survey!C34)/(Survey!E34-Survey!E35))^2)^0.5,0))))","v":0},{"$f":"IF(ISNA(Survey!E35),0,IF(Survey!E34<Survey!K$21,IF(Survey!E35<Survey!K$21,(Survey!K$21-(Survey!E34+Survey!E35)*0.5)*C14,(Survey!K$21-Survey!E34)*0.5*C14),IF(Survey!E35<Survey!K$21,(Survey!K$21-Survey!E35)*0.5*C14,0)))","v":0},{"$f":"IF(ISNA(Survey!E35),0,IF(Survey!E34<Survey!K$21,IF(Survey!E35<Survey!K$21,(C14^2+(Survey!E35-Survey!E34)^2)^0.5,(C14^2+(Survey!K$21-Survey!E34)^2)^0.5),IF(Survey!E35<Survey!K$21,(C14^2+(Survey!K$21-Survey!E35)^2)^0.5,0)))","v":0},{"$f":"IF(Survey!$C34<Access!$C$28,'Calc.'!C14,0)","v":0},{"$f":"IF(Survey!$C34>=Access!$C$28,'Calc.'!C14,0)","v":0}]
[{"$f":"Survey!$K$21","v":0},{"$error":"#N/A"},{"$f":"IF(Survey!C35-Survey!C36<0,1,-1)*(IF(ISNA(Survey!E36),0,IF(Survey!E35<Survey!K$21,IF(Survey!E36<Survey!K$21,((Survey!C36-Survey!C35)^2)^0.5,(((Survey!K$21-Survey!E35)*(Survey!C36-Survey!C35)/(Survey!E36-Survey!E35))^2)^0.5),IF(Survey!E36<Survey!K$21,(((Survey!K$21-Survey!E36)*(Survey!C36-Survey!C35)/(Survey!E35-Survey!E36))^2)^0.5,0))))","v":0},{"$f":"IF(ISNA(Survey!E36),0,IF(Survey!E35<Survey!K$21,IF(Survey!E36<Survey!K$21,(Survey!K$21-(Survey!E35+Survey!E36)*0.5)*C15,(Survey!K$21-Survey!E35)*0.5*C15),IF(Survey!E36<Survey!K$21,(Survey!K$21-Survey!E36)*0.5*C15,0)))","v":0},{"$f":"IF(ISNA(Survey!E36),0,IF(Survey!E35<Survey!K$21,IF(Survey!E36<Survey!K$21,(C15^2+(Survey!E36-Survey!E35)^2)^0.5,(C15^2+(Survey!K$21-Survey!E35)^2)^0.5),IF(Survey!E36<Survey!K$21,(C15^2+(Survey!K$21-Survey!E36)^2)^0.5,0)))","v":0},{"$f":"IF(Survey!$C35<Access!$C$28,'Calc.'!C15,0)","v":0},{"$f":"IF(Survey!$C35>=Access!$C$28,'Calc.'!C15,0)","v":0}]
[{"$f":"Survey!$K$21","v":0},{"$error":"#N/A"},{"$f":"IF(Survey!C36-Survey!C37<0,1,-1)*(IF(ISNA(Survey!E37),0,IF(Survey!E36<Survey!K$21,IF(Survey!E37<Survey!K$21,((Survey!C37-Survey!C36)^2)^0.5,(((Survey!K$21-Survey!E36)*(Survey!C37-Survey!C36)/(Survey!E37-Survey!E36))^2)^0.5),IF(Survey!E37<Survey!K$21,(((Survey!K$21-Survey!E37)*(Survey!C37-Survey!C36)/(Survey!E36-Survey!E37))^2)^0.5,0))))","v":0},{"$f":"IF(ISNA(Survey!E37),0,IF(Survey!E36<Survey!K$21,IF(Survey!E37<Survey!K$21,(Survey!K$21-(Survey!E36+Survey!E37)*0.5)*C16,(Survey!K$21-Survey!E36)*0.5*C16),IF(Survey!E37<Survey!K$21,(Survey!K$21-Survey!E37)*0.5*C16,0)))","v":0},{"$f":"IF(ISNA(Survey!E37),0,IF(Survey!E36<Survey!K$21,IF(Survey!E37<Survey!K$21,(C16^2+(Survey!E37-Survey!E36)^2)^0.5,(C16^2+(Survey!K$21-Survey!E36)^2)^0.5),IF(Survey!E37<Survey!K$21,(C16^2+(Survey!K$21-Survey!E37)^2)^0.5,0)))","v":0},{"$f":"IF(Survey!$C36<Access!$C$28,'Calc.'!C16,0)","v":0},{"$f":"IF(Survey!$C36>=Access!$C$28,'Calc.'!C16,0)","v":0}]
[{"$f":"Survey!$K$21","v":0},{"$error":"#N/A"},{"$f":"IF(Survey!C37-Survey!C38<0,1,-1)*(IF(ISNA(Survey!E38),0,IF(Survey!E37<Survey!K$21,IF(Survey!E38<Survey!K$21,((Survey!C38-Survey!C37)^2)^0.5,(((Survey!K$21-Survey!E37)*(Survey!C38-Survey!C37)/(Survey!E38-Survey!E37))^2)^0.5),IF(Survey!E38<Survey!K$21,(((Survey!K$21-Survey!E38)*(Survey!C38-Survey!C37)/(Survey!E37-Survey!E38))^2)^0.5,0))))","v":0},{"$f":"IF(ISNA(Survey!E38),0,IF(Survey!E37<Survey!K$21,IF(Survey!E38<Survey!K$21,(Survey!K$21-(Survey!E37+Survey!E38)*0.5)*C17,(Survey!K$21-Survey!E37)*0.5*C17),IF(Survey!E38<Survey!K$21,(Survey!K$21-Survey!E38)*0.5*C17,0)))","v":0},{"$f":"IF(ISNA(Survey!E38),0,IF(Survey!E37<Survey!K$21,IF(Survey!E38<Survey!K$21,(C17^2+(Survey!E38-Survey!E37)^2)^0.5,(C17^2+(Survey!K$21-Survey!E37)^2)^0.5),IF(Survey!E38<Survey!K$21,(C17^2+(Survey!K$21-Survey!E38)^2)^0.5,0)))","v":0},{"$f":"IF(Survey!$C37<Access!$C$28,'Calc.'!C17,0)","v":0},{"$f":"IF(Survey!$C37>=Access!$C$28,'Calc.'!C17,0)","v":0}]
[{"$f":"Survey!$K$21","v":0},{"$error":"#N/A"},{"$f":"IF(Survey!C38-Survey!C39<0,1,-1)*(IF(ISNA(Survey!E39),0,IF(Survey!E38<Survey!K$21,IF(Survey!E39<Survey!K$21,((Survey!C39-Survey!C38)^2)^0.5,(((Survey!K$21-Survey!E38)*(Survey!C39-Survey!C38)/(Survey!E39-Survey!E38))^2)^0.5),IF(Survey!E39<Survey!K$21,(((Survey!K$21-Survey!E39)*(Survey!C39-Survey!C38)/(Survey!E38-Survey!E39))^2)^0.5,0))))","v":0},{"$f":"IF(ISNA(Survey!E39),0,IF(Survey!E38<Survey!K$21,IF(Survey!E39<Survey!K$21,(Survey!K$21-(Survey!E38+Survey!E39)*0.5)*C18,(Survey!K$21-Survey!E38)*0.5*C18),IF(Survey!E39<Survey!K$21,(Survey!K$21-Survey!E39)*0.5*C18,0)))","v":0},{"$f":"IF(ISNA(Survey!E39),0,IF(Survey!E38<Survey!K$21,IF(Survey!E39<Survey!K$21,(C18^2+(Survey!E39-Survey!E38)^2)^0.5,(C18^2+(Survey!K$21-Survey!E38)^2)^0.5),IF(Survey!E39<Survey!K$21,(C18^2+(Survey!K$21-Survey!E39)^2)^0.5,0)))","v":0},{"$f":"IF(Survey!$C38<Access!$C$28,'Calc.'!C18,0)","v":0},{"$f":"IF(Survey!$C38>=Access!$C$28,'Calc.'!C18,0)","v":0}]
[{"$f":"Survey!$K$21","v":0},{"$error":"#N/A"},{"$f":"IF(Survey!C39-Survey!C40<0,1,-1)*(IF(ISNA(Survey!E40),0,IF(Survey!E39<Survey!K$21,IF(Survey!E40<Survey!K$21,((Survey!C40-Survey!C39)^2)^0.5,(((Survey!K$21-Survey!E39)*(Survey!C40-Survey!C39)/(Survey!E40-Survey!E39))^2)^0.5),IF(Survey!E40<Survey!K$21,(((Survey!K$21-Survey!E40)*(Survey!C40-Survey!C39)/(Survey!E39-Survey!E40))^2)^0.5,0))))","v":0},{"$f":"IF(ISNA(Survey!E40),0,IF(Survey!E39<Survey!K$21,IF(Survey!E40<Survey!K$21,(Survey!K$21-(Survey!E39+Survey!E40)*0.5)*C19,(Survey!K$21-Survey!E39)*0.5*C19),IF(Survey!E40<Survey!K$21,(Survey!K$21-Survey!E40)*0.5*C19,0)))","v":0},{"$f":"IF(ISNA(Survey!E40),0,IF(Survey!E39<Survey!K$21,IF(Survey!E40<Survey!K$21,(C19^2+(Survey!E40-Survey!E39)^2)^0.5,(C19^2+(Survey!K$21-Survey!E39)^2)^0.5),IF(Survey!E40<Survey!K$21,(C19^2+(Survey!K$21-Survey!E40)^2)^0.5,0)))","v":0},{"$f":"IF(Survey!$C39<Access!$C$28,'Calc.'!C19,0)","v":0},{"$f":"IF(Survey!$C39>=Access!$C$28,'Calc.'!C19,0)","v":0}]
[{"$f":"Survey!$K$21","v":0},{"$error":"#N/A"},{"$f":"IF(Survey!C40-Survey!C41<0,1,-1)*(IF(ISNA(Survey!E41),0,IF(Survey!E40<Survey!K$21,IF(Survey!E41<Survey!K$21,((Survey!C41-Survey!C40)^2)^0.5,(((Survey!K$21-Survey!E40)*(Survey!C41-Survey!C40)/(Survey!E41-Survey!E40))^2)^0.5),IF(Survey!E41<Survey!K$21,(((Survey!K$21-Survey!E41)*(Survey!C41-Survey!C40)/(Survey!E40-Survey!E41))^2)^0.5,0))))","v":0},{"$f":"IF(ISNA(Survey!E41),0,IF(Survey!E40<Survey!K$21,IF(Survey!E41<Survey!K$21,(Survey!K$21-(Survey!E40+Survey!E41)*0.5)*C20,(Survey!K$21-Survey!E40)*0.5*C20),IF(Survey!E41<Survey!K$21,(Survey!K$21-Survey!E41)*0.5*C20,0)))","v":0},{"$f":"IF(ISNA(Survey!E41),0,IF(Survey!E40<Survey!K$21,IF(Survey!E41<Survey!K$21,(C20^2+(Survey!E41-Survey!E40)^2)^0.5,(C20^2+(Survey!K$21-Survey!E40)^2)^0.5),IF(Survey!E41<Survey!K$21,(C20^2+(Survey!K$21-Survey!E41)^2)^0.5,0)))","v":0},{"$f":"IF(Survey!$C40<Access!$C$28,'Calc.'!C20,0)","v":0},{"$f":"IF(Survey!$C40>=Access!$C$28,'Calc.'!C20,0)","v":0}]
{"$rows_left_out":18}
{"sheet":"Draw LG","index":9,"n_rows":0,"n_cols":0,"rows_kept":0,"cut":false,"hidden":false,"merged":[]}

{"sheet":"Draw MG","index":10,"n_rows":0,"n_cols":0,"rows_kept":0,"cut":false,"hidden":false,"merged":[]}

{"sheet":"Draw SB","index":11,"n_rows":0,"n_cols":0,"rows_kept":0,"cut":false,"hidden":false,"merged":[]}

{"sheet":"Draw AC","index":12,"n_rows":0,"n_cols":0,"rows_kept":0,"cut":false,"hidden":false,"merged":[]}