{"text_format":"1","workbook":"xlsx","n_sheets":6,"sheets":["Culvert Analysis","Culvert Data","Culvert Entrance Conditions","Help Information","help for macros","Help for Macros Excel 2010"],"not_rendered":{"charts":0,"images":17,"macros":1,"external_links":0,"defined_names":52,"comments":1,"pivot_tables":0},"unopened":[],"bounds":{"document_bytes":16777216,"sheet_cells":100000,"rows_first":2000,"rows_last":500,"rows_between":2000,"halvings":0,"cell_chars":16384,"cell_head_chars":4096},"cells_cut":0,"cells_raw":0,"read":"whole","date_system":"1900"}

{"sheet":"Culvert Analysis","index":0,"n_rows":145,"n_cols":497,"rows_kept":145,"cut":false,"hidden":false,"merged":[[4,1,4,4]]}
["Culvert Analysis Spreadsheet",null,null,null,null,null,"IaCulvertDesign.xlsm V1.0"]
[]
["Client:",null,null,"County:",null,"Date:  "]
["Design By:",null,null,"Checked By:",null,"Date:  "]
["Comments:"]
[]
[]
[]
[]
[]
[]
[]
[]
["Inputs:"]
[null,"Headwater (Upstream Water Surface) Elevation:  ",null," Feet"]
[null,"Culvert Inlet Invert Elevation:  ",null," Feet"]
[null,"Culvert Diameter:   ",null," Inches","Select Culvert Material:  ","CMP_2.67x0.5"]
[null,"Length of Culvert:  ",null," Feet","Select Culvert Inlet Type:  ","Projecting - Thin Edge"]
[null,"Culvert Outlet Invert Elevation:  ",null," Feet",null,{"$f":"IF(ISNUMBER(IFERROR(B42,\"Select an Inlet Type\")),\"\",IFERROR(B42,\"Select an Inlet Type\"))","v":""}]
[null,"Tailwater (Downstream) Elevation:  ",null," Feet"]
[]
[]
[]
[]
["Outputs:"]
[null,"CAPACITY = ",{"$f":"IF(C140=\"FALSE\",\"\",B124)","v":""},"cfs",{"$f":"IF(C140=\"FALSE\",\"MUST Select Compute Button to Re-Calculate\",A123)","v":"MUST Select Compute Button to Re-Calculate"}]
[]
[null,null,"Manning's n value:  ",{"$f":"VLOOKUP(F17,'Culvert Data'!A3:B9,2,FALSE)","v":2.4E-2},{"$f":"F17","v":"CMP_2.67x0.5"}]
[null,null,"Entrance Coefficient, Ke:  ",{"$f":"VLOOKUP(F18,'Culvert Data'!A15:B20,2,FALSE)","v":0.9},{"$f":"F18","v":"Projecting - Thin Edge"}]
[]
[]
[{"$f":"IF(C140=\"FALSE\",\"\",\"Scroll Down to View Computations\")","v":""}]
[]
[]
["Calculations:"]
[]
["Headwater (HW)"]
["HW Depth = ",{"$f":"C15-C16","v":0},"feet",{"$f":"B38*12","v":0},"inches","Tailwater (TW) Depth = ",{"$f":"IF((C20-C19)<0,0,C20-C19)","v":0},"feet"]
["Diameter, D",{"$f":"C17/12","v":0},"feet",{"$f":"B39*12","v":0},"inches"]
["Culvert Slope, S",{"$f":"(C16-C19)/C18","v":{"$error":"#DIV/0!"}},"ft/ft"]
["Area = ",{"$f":"PI()*(B39/2)^2","v":0},"ft2",null,"Wetted Perimeter = ",{"$f":"PI()*B39","v":0},null,null,"Hydraulic Radius = ",{"$f":"B41/F41","v":{"$error":"#DIV/0!"}}]
["K =",{"$f":"IF(F$17=\"Concrete\", VLOOKUP(F$18,'Culvert Data'!C28:H31,3,FALSE), IF(F$17=\"CMP_2.67x0.5\",VLOOKUP(F$18,'Culvert Data'!C$32:H$34,3,FALSE),IF(F$17=\"PVC_Plastic\",VLOOKUP(F$18,'Culvert Data'!C$35:H36,3,FALSE),IF(F$17=\"Smooth_HDPE\",VLOOKUP(F$18,'Culvert Data'!C$37:H$39,3,FALSE),IF(F$17=\"Corrugated_PE\",VLOOKUP(F$18,'Culvert Data'!C$40:H$42,3,FALSE),IF(F$17=\"CMP_3x1\",VLOOKUP(F$18,'Culvert Data'!C$43:H$45,3,FALSE),IF(F$17=\"Welded_Steel\",VLOOKUP(F$18,'Culvert Data'!C$46:H$48,3,FALSE),\"Data Not Available\")))))))","v":3.4000000000000002E-2}]
["M = ",{"$f":"IF(F$17=\"Concrete\", VLOOKUP(F$18,'Culvert Data'!C28:H31,4,FALSE), IF(F$17=\"CMP_2.67x0.5\",VLOOKUP(F$18,'Culvert Data'!C$32:H$34,4,FALSE),IF(F$17=\"PVC_Plastic\",VLOOKUP(F$18,'Culvert Data'!C$35:H36,4,FALSE),IF(F$17=\"Smooth_HDPE\",VLOOKUP(F$18,'Culvert Data'!C$37:H$39,4,FALSE),IF(F$17=\"Corrugated_PE\",VLOOKUP(F$18,'Culvert Data'!C$40:H$42,4,FALSE),IF(F$17=\"CMP_3x1\",VLOOKUP(F$18,'Culvert Data'!C$43:H$45,4,FALSE),IF(F$17=\"Welded_Steel\",VLOOKUP(F$18,'Culvert Data'!C$46:H$48,4,FALSE),\"Data Not Available\")))))))","v":1.5}]
["c = ",{"$f":"IF(F$17=\"Concrete\", VLOOKUP(F$18,'Culvert Data'!C28:H31,5,FALSE), IF(F$17=\"CMP_2.67x0.5\",VLOOKUP(F$18,'Culvert Data'!C$32:H$34,5,FALSE),IF(F$17=\"PVC_Plastic\",VLOOKUP(F$18,'Culvert Data'!C$35:H36,5,FALSE),IF(F$17=\"Smooth_HDPE\",VLOOKUP(F$18,'Culvert Data'!C$37:H$39,5,FALSE),IF(F$17=\"Corrugated_PE\",VLOOKUP(F$18,'Culvert Data'!C$40:H$42,5,FALSE),IF(F$17=\"CMP_3x1\",VLOOKUP(F$18,'Culvert Data'!C$43:H$45,5,FALSE),IF(F$17=\"Welded_Steel\",VLOOKUP(F$18,'Culvert Data'!C$46:H$48,5,FALSE),\"Data Not Available\")))))))","v":5.5300000000000002E-2}]
["Y",{"$f":"IF(F$17=\"Concrete\", VLOOKUP(F$18,'Culvert Data'!C28:H31,6,FALSE), IF(F$17=\"CMP_2.67x0.5\",VLOOKUP(F$18,'Culvert Data'!C$32:H$34,6,FALSE),IF(F$17=\"PVC_Plastic\",VLOOKUP(F$18,'Culvert Data'!C$35:H36,6,FALSE),IF(F$17=\"Smooth_HDPE\",VLOOKUP(F$18,'Culvert Data'!C$37:H$39,6,FALSE),IF(F$17=\"Corrugated_PE\",VLOOKUP(F$18,'Culvert Data'!C$40:H$42,6,FALSE),IF(F$17=\"CMP_3x1\",VLOOKUP(F$18,'Culvert Data'!C$43:H$45,6,FALSE),IF(F$17=\"Welded_Steel\",VLOOKUP(F$18,'Culvert Data'!C$46:H$48,6,FALSE),\"Data Not Available\")))))))","v":0.54}]
["Friction Loss Kf = ",{"$f":"29*D28^2/(J41)^(4/3)","v":{"$error":"#DIV/0!"}}]
["0.5S = ",{"$f":"0.5*B40","v":{"$error":"#DIV/0!"}},"For non mitered inlets",null,null,"USE:",{"$f":"IF(F18='Culvert Data'!C33,-'Culvert Analysis'!B48,'Culvert Analysis'!B47)","v":{"$error":"#DIV/0!"}}]
["0.7S =",{"$f":"0.7*B40","v":{"$error":"#DIV/0!"}},"For mitered inlets ( use -ve value)"]
[]
["Unsubmerged Equation Form (1):  Reference:  FHWA  \"Hydraulic Design of Highway Culverts\", Table 8, p. 192, Revised 2005.",null,null,null,null,null,"Note:  This equation applies for Q/(AD^0.5)<= ~3.5"]
[]
["Q = AD0.5 * [ 1/K * (HW/D - Hc/D + 0.5S)]1/m"]
[]
["AD0.5 =   ",{"$f":"B41*B39^0.5","v":0}]
["1/K =",{"$f":"1/B42","v":29.411764705882351}]
["HW/D =",{"$f":"B38/B39","v":{"$error":"#DIV/0!"}}]
["0.5S (from above)",{"$f":"G47","v":{"$error":"#DIV/0!"}}]
[]
["Hc depends on Q"]
["Assumed Q =",0.5,"cfs","Initial Q =",{"$f":"IF(MIN(B41,B60,B67)=0,0.1,MIN(B41,B60,B67))","v":0.1},null,null,"Q2/g =",{"$f":"B60^2/32.2","v":7.7639751552795021E-3},null,null,null,null,null,"A = D2/8 [2 cos-1 (1 - (2d/D)) - sin (2 cos-1 (1-(2d/D)))] =",{"$f":"B39^2/8*(2*ACOS(1-(2*B61/B39))-SIN(2*ACOS(1-(2*B61/B39))))","v":{"$error":"#DIV/0!"}},null,null,null,null,null,null,null,null,null,null,null,null,null,null,null,null,null,null,null,null,null,null,null,null,null,null,null,null,null,null,null,null,null,null,null,null,null,90.587271742897158]
["dc =",{"$error":"#DIV/0!"},null,"Initial dc =",{"$f":"IF((0.325*((E60/B39)^0.6666)+0.083*B39)<B39,0.325*((E60/B39)^0.6666)+0.083*B39,0.99*B39)","v":{"$error":"#DIV/0!"}},"From Chow Approx dc eqn",null,null,null,null,null,null,null,null,"T = D sin( cos-1( (2d - D)/D)) =",{"$f":" B39*SIN(ACOS((2*B61-B39)/B39))","v":{"$error":"#DIV/0!"}}]
["q=",{"$f":"IF(B61>B39,0,IF(B61>(B39/2),4*(ACOS((B61/B39)^0.5))*360/(2*PI()),4*(ASIN((B61/B39)^0.5))*360/(2*PI())))","v":{"$error":"#DIV/0!"}},"degrees",null,"0.99 * Diameter =",{"$f":"0.99*B39","v":0},null,null,null,null,null,null,null,null,"A3 / T =",{"$f":"P60^3/P61","v":{"$error":"#DIV/0!"}},null,null,null,"Need Q2/g = A3/T",null,"Error =",{"$f":"ABS(P62-I60)","v":{"$error":"#DIV/0!"}}]
["Area at dc =",{"$f":"IF(B61>(B39/2),((B39^2)/8)*((PI()*2-(PI()*B62/180)+(SIN(B62*2*PI()/360)))),((B39^2)/8*((PI()*B62/180-SIN(B62*2*PI()/360)))))","v":{"$error":"#DIV/0!"}},"ft2",null,"0.1 * Diameter =",{"$f":"0.1*B39","v":0}]
["Vc = Q/Ac =",{"$f":"B60/B63","v":{"$error":"#DIV/0!"}},"ft/sec"]
["Hc= dc+V2/2g =",{"$f":"B61+(B64^2)/64.4","v":{"$error":"#DIV/0!"}},"ft"]
["Hc/D = ",{"$f":"B65/B39","v":{"$error":"#DIV/0!"}},"ft/ft"]
["Calculated Qunsub =",{"$f":"IF(ISERROR(IF((B56-B66+B57)<0,0,B54*(B55*(B56-B66+B57))^(1/B43))),\"\",IF((B56-B66+B57)<0,0,B54*(B55*(B56-B66+B57))^(1/B43)))","v":""},"cfs","Note:  Solution by Trial and Error Using \"Data, Analysis, Solver\" in Macro",null,null,null,"Error =",{"$f":"ABS(B60-B67)","v":{"$error":"#VALUE!"}},null,null,"Check for Convergence:  ",{"$f":"ABS((B60-B67)/B67*100)","v":{"$error":"#VALUE!"}},"Percent",null,{"$f":"IF(M67<0.1,\"Converged within 0.1%\",IF(M67<0.5,\"Converged within 0.5%\",IF(M67<1,\"Converged within 1.0%\",IF(M67<5,\"Converged within 5.0%\",IF(M67<10,\"Converged within 10%\",\"Calculations Did not converge within 10%\")))))","v":{"$error":"#VALUE!"}}]
[]
["Check of Q/(AD0.5)",{"$f":"B67/B54","v":{"$error":"#VALUE!"}},null,{"$f":"IF(B69>3.5,\"!! Q/(AD^0.5) too high, Equation not Valid!!\", \"Value of Q/(AD^0.5) within acceptable range\")","v":{"$error":"#VALUE!"}}]
[]
[]
["Submerged Inlet control Equation:  Reference:  FHWA  \"Hydraulic Design of Highway Culverts\", Table 8, p. 192, Revised 2005.",null,null,null,null,null,null,"Note:  This equation only applies for Q/(AD^0.5)>~4.0"]
[]
["Qinlet control = ",{"$f":"IF((E74+G47-B45)<0,0,(E77*((E74+G47-B45)/B44)^0.5))","v":{"$error":"#DIV/0!"}},null,"Hwi/D = ",{"$f":"B38/B39","v":{"$error":"#DIV/0!"}}]
[]
[{"$f":"IF(E78<4,\"Q/AD^0.5 is less than 4, Equation Does not Apply!\",\"\")","v":{"$error":"#DIV/0!"}}]
[null,null,null,"AD0.5 =",{"$f":"B41*B39^0.5","v":0}]
[null,null,null,"Q/(AD0.5) =",{"$f":"B74/E77","v":{"$error":"#DIV/0!"}}]
[null,null,null,{"$f":"IF(E78<4,\"Submerged Inlet Control Equation does not Apply\",\"\")","v":{"$error":"#DIV/0!"}}]
[]
{"$rows_left_out":66}
{"sheet":"Culvert Data","index":1,"n_rows":48,"n_cols":10,"rows_kept":48,"cut":false,"hidden":false,"merged":[]}
["Manning's \"n\" Values:"]
["Culvert Material","\"n\" Value"]
["Concrete",1.2E-2,"Reference:  FHWA \"Hydraulic Design of Highway Culverts\""]
["CMP_2.67x0.5",2.4E-2,"Reference:  FHWA \"Hydraulic Design of Highway Culverts\""]
["CMP_3x1",2.8000000000000001E-2,"Reference:  FHWA \"Hydraulic Design of Highway Culverts\""]
["Welded_Steel",0.01,"EFH 6 IA-46(2)"]
["PVC_Plastic",1.0999999999999999E-2,"Reference:  HY8 User Guide"]
["Corrugated_PE",2.4E-2,"Reference:  HY8 User Guide"]
["Smooth_HDPE",1.2E-2,"Reference:  HY8 User Guide"]
[]
[]
[]
["Culvert Entrance Type:","Source:  FHWA \"Hydraulic Design of Highway Culverts\", Table 12, 1985."]
["Entrance Type","Ke"]
["Projecting - Groove Edge",0.2]
["Projecting - Square Edge",0.5]
["Projecting - Thin Edge",0.9]
["Headwall - Groove Edge",0.2]
["Headwall - Square Edge",0.5]
["Miter/Square/2:1 Slope",0.7]
[]
[]
["Constants for Inlet Control Design Equations",null,"Source:  FHWA \"Hydraulic Design of Highway Culverts\", Table 9, 1985."]
[]
[null,null,null,"Equation","  Unsubmerged Constants",null,"   Submerged Constants"]
["Culvert Shape","Culvert Material","Entrance Type Description","Form","K","M","c","Y"]
[]
["Circular","Concrete","Headwall - Square Edge",1,9.7999999999999997E-3,2,3.9800000000000002E-2,0.67]
["Circular","Concrete","Headwall - Groove Edge",1,7.7999999999999996E-3,2,2.92E-2,0.74]
["Circular","Concrete","Projecting - Groove Edge",1,4.4999999999999997E-3,2,3.1699999999999999E-2,0.69]
["Circular","Concrete","Projecting - Square Edge",null,1.4500000000000001E-2,1.75,4.1200000000000001E-2,0.64,null,"Reference?  Or use the same as headwall - square edge.  See Hydraulic Design of Highway Culverts 3rd sentence of last paragraph on p. 25"]
["Circular","CMP_2.67x0.5","Headwall - Square Edge",1,7.7999999999999996E-3,2,3.7900000000000003E-2,0.69]
["Circular","CMP_2.67x0.5","Miter/Square/2:1 Slope",1,2.1000000000000001E-2,1.33,4.6300000000000001E-2,0.75]
["Circular","CMP_2.67x0.5","Projecting - Thin Edge",1,3.4000000000000002E-2,1.5,5.5300000000000002E-2,0.54]
["Circular","PVC_Plastic","Headwall - Square Edge",1,9.7999999999999997E-3,2,3.9800000000000002E-2,0.67,null,"From HY8 User Guide - same as for Concrete Pipe Square Edge with Headwall"]
["Circular","PVC_Plastic","Miter/Square/2:1 Slope",1,2.1000000000000001E-2,1.33,4.6300000000000001E-2,0.75,null,"From HY8 User Guide - same as for Corrugated Metal Pipe culvert, Mitered to conform to slope"]
["Circular","Smooth_HDPE","Headwall - Square Edge",1,9.7999999999999997E-3,2,3.9800000000000002E-2,0.67,null,"From HY8 User Guide - same as for Concrete Pipe Square Edge with Headwall"]
["Circular","Smooth_HDPE","Projecting - Thin Edge",1,3.4000000000000002E-2,1.5,5.5300000000000002E-2,0.54,null,"From HY8 User Guide - same as for CMP Projecting - Thin Edge"]
["Circular","Smooth_HDPE","Miter/Square/2:1 Slope",1,2.1000000000000001E-2,1.33,4.6300000000000001E-2,0.75,null,"From HY8 User Guide - same as for Corrugated Metal Pipe culvert, Mitered to conform to slope"]
["Circular","Corrugated_PE","Headwall - Square Edge",1,7.7999999999999996E-3,2,3.7900000000000003E-2,0.69,null,"From HY8 User Guide - same as for Corrugated Metal Pipe culvert with Headwall"]
["Circular","Corrugated_PE","Projecting - Thin Edge",1,3.4000000000000002E-2,1.5,5.5300000000000002E-2,0.54,null,"From HY8 User Guide - same as for CMP Projecting - Thin Edge"]
["Circular","Corrugated_PE","Miter/Square/2:1 Slope",1,2.1000000000000001E-2,1.33,4.6300000000000001E-2,0.75,null,"From HY8 User Guide - same as for Corrugated Metal Pipe culvert, Mitered to conform to slope"]
["Circular","CMP_3x1","Headwall - Square Edge",1,7.7999999999999996E-3,2,3.7900000000000003E-2,0.69]
["Circular","CMP_3x1","Miter/Square/2:1 Slope",1,2.1000000000000001E-2,1.33,4.6300000000000001E-2,0.75]
["Circular","CMP_3x1","Projecting - Thin Edge",1,3.4000000000000002E-2,1.5,5.5300000000000002E-2,0.54]
["Circular","Welded_Steel","Headwall - Square Edge",1,7.7999999999999996E-3,2,3.7900000000000003E-2,0.69]
["Circular","Welded_Steel","Miter/Square/2:1 Slope",1,2.1000000000000001E-2,1.33,4.6300000000000001E-2,0.75]
["Circular","Welded_Steel","Projecting - Thin Edge",1,3.4000000000000002E-2,1.5,5.5300000000000002E-2,0.54]

{"sheet":"Culvert Entrance Conditions","index":2,"n_rows":42,"n_cols":26,"rows_kept":42,"cut":false,"hidden":false,"merged":[]}
["Culvert Entrance Conditions:   "]
[]
[]
[]
[]
[]
[]
[]
[]
[]
[]
[]
[]
[]
[]
["Projecting Groove Edge (Applies only to Concrete Culverts ",null,null,null,null,null,null,null,null,null,null,null,"Projecting Square Edge (Applies to Concrete Culverts for ",null,null,null,null,null,null,null,null,null,null,null,"Projecting Thin Edge (Applies to Corrugated Metal Pipe (CMP), "]
[null,"with the socket end projecting from the fill)",null,null,null,null,null,null,null,null,null,null,null,"non-socket end of the pipe projecting from the fill)",null,null,null,null,null,null,null,null,null,null,null,"Smooth HDPE or Corrugated PE culverts projecting from the fill)"]
[]
[]
[]
[]
[]
[]
[]
[]
[]
[]
[]
[]
[]
[]
[]
[]
[]
[]
[]
[]
[]
[]
["Headwall – Groove Edge (applies to Concrete pipe with the ",null,null,null,null,null,null,null,null,null,null,null,"Headwall – Square Edge (applies to Concrete, CMP, PVC plastic,",null,null,null,null,null,null,null,null,null,null,null,"Miter/Square/2:1 Slope (applies to CMP, PVC plastic, Smooth HDPE or "]
[null,"socket end in combination with a concrete headwall)",null,null,null,null,null,null,null,null,null,null,null,"Smooth HDPE, or Corrugated PE culverts with a concrete ",null,null,null,null,null,null,null,null,null,null,null,"Corrugated PE culverts that are mitered to conform to the slope)"]
[null,null,null,null,null,null,null,null,null,null,null,null,null,"headwall and a square edge entrance)"]

{"sheet":"Help Information","index":3,"n_rows":46,"n_cols":10,"rows_kept":46,"cut":false,"hidden":false,"merged":[]}
[{"$f":"'Culvert Analysis'!G1","v":"IaCulvertDesign.xlsm V1.0"},null,null,null,null,null,null,null,null,"2017-12-05"]
["This is the Wisconsin CulvertDesign_1_20_2015.xlsm spreadsheet. "]
["CMP with 3x1 corrugations and Welded Steel Pipe have been added to the list of materials"]
[]
["New User Information:"]
["Note that this spreadsheet was designed using Excel 2007.  If you are using Excel 2003 or earlier, the spreadsheet probably will not work!"]
["If you are using this spreadsheet for the first time, it is important that you install several key Excel Options.  Select the \"Help for Macros\" button below and follow the instructions to install these options."]
[]
["NOTE for Excel 2010:  Be sure that the calculations are set to automatic.  Check this by selecting the following:"]
["     File, Options, Formulas, Calculation options, and then under \"Workbook Calculation\" be sure that \"automatic\" is selected."]
[]
["Limitations of the Culvert Analysis Spreadsheet:"]
["This spreadsheet applies to single Circular Culverts only (not rectangular, elliptical or other shapes)."]
["This spreadsheet should not be used to analyze culverts with bends or slope changes."]
["This spreadsheet applies to concrete (RCP), corrugated metal pipe (CMP), PVC plastic, Smooth HDPE, or Corrugated PE culvert materials."]
["It does not analyze partially filled (with rock or sediment) culverts."]
["The outlet control calculations use the assumption of a 1.0 for the exit coefficient (i.e. the downstream channel velocity is not considered in the exit loss calculations)."]
["Free surface (channel flow) calculations are approximate.  They do not involve a detailed water surface profile analysis…"]
["This spreadsheet does not analyze road overtopping.  "]
["For very high headwater depths (e.g. greater than 15') another method (e.g. HEC-RAS or HY-8) is recommended for analysis."]
[]
["This spreadsheet provides an approximate culvert hydraulic analysis a variety of conditions.  However, it does not include a detailed water surface profile analysis.  "]
["A downstream tailwater elevation must be entered as input data, and the tailwater elevation that is entered may significantly impact the resulting computed culvert capacity. "]
["If a restriction (e.g. another culvert or bridge) is located a short distance downstream of this site, or if detailed water surface profiles are required, another method, such as "]
["HEC-RAS (more complex, but detailed), or HY-8. should be used."]
[]
[]
["Description:"]
["The spreadsheet checks for inlet control (submerged and unsubmerged), outlet control (full flow and part full), and approximate free surface (channel flow) conditions.  "]
["The equations that were used for inlet control (submerged and unsubmerged) and for outlet control (full flow and part full) were taken from Reference 1 below."]
["Calculations are made for each potentially applicable condition;  however, the discharge for the controlling condition is selected and indicated directly below the "]
["input section near the top of the Culvert Analysis sheet.  The controlling condition is also indicated."]
[]
[]
["References: "]
["Hydraulic Design of Highway Culverts, Hydraulic Design Series No. 5, US Department of Transportation, Federal Highway Administration, Revised May 2005"]
["HY8 Federal Highway Administration's Culvert Analysis Program User Guide"]
["US Army Corps of Engineers, Hydrologic Engineering Center (HEC), HEC-RAS, River Analysis System Hydraulic Reference Manual, March 2008"]
[]
[]
[]
[]
[]
[]
[]
["If you are having problems with getting the Macro's to Work in this Spreadsheet, please Select \"Help for Macros\" and Follow the instructions"]

{"sheet":"help for macros","index":4,"n_rows":103,"n_cols":1,"rows_kept":103,"cut":false,"hidden":false,"merged":[]}
["NEW User Instructions:  for Excel 2007.  If using Excel 2010 see next Tab (Help for Macros Excel 2010)!"]
["Note that this spreadsheet was designed using Excel 2007.  If you are using Excel 2003 or earlier, the spreadsheet probably will not work!"]
["If you are using this spreadsheet for the first time, it is important that you install several key Excel Options!"]
["Note that you do not need \"Administrative Privileges\" to install these options, just follow these instructions:"]
["It would help to print these instructions to use while you are installing these options"]
[]
["Select the Office Button in the upper left corner of the Excel Screen:"]
[]
[]
[]
["When the new window opens, select the “Excel Options” button at the bottom of this window."]
[]
[]
[]
[]
[]
[]
[]
[]
[]
[]
[]
[]
[]
[]
[]
[]
[]
[]
[]
[]
[]
["Select the “Popular” option on the left side of the Excel Options screen and be sure that the option"]
["“Show Developer tab in the Ribbon” is selected:"]
[]
[]
[]
[]
[]
[]
[]
[]
[]
[]
[]
[]
[]
[]
[]
[]
[]
[]
[]
[]
[]
[]
[]
[]
[]
[]
[]
[]
[]
[]
[]
["Then, select “Add‐Ins” option from the Excel Options window:"]
[]
[]
[]
[]
[]
[]
[]
[]
[]
[]
[]
[]
[]
[]
{"$rows_left_out":24}
{"sheet":"Help for Macros Excel 2010","index":5,"n_rows":103,"n_cols":1,"rows_kept":103,"cut":false,"hidden":false,"merged":[]}
["NEW User Instructions:  for Excel 2010"]
[]
["If you are using this spreadsheet for the first time, it is important that you install several key Excel Options!"]
["Note that you do not need \"Administrative Privileges\" to install these options, just follow these instructions:"]
["It would help to print these instructions to use while you are installing these options"]
[]
["Select the File Tab Above (on Upper Left) of Excel Screen"]
[]
[]
[]
["When the new window opens, select the “Options” at the lower left of the window"]
[]
[]
[]
[]
[]
[]
[]
[]
[]
[]
[]
[]
[]
[]
[]
[]
[]
[]
[]
[]
[]
["Select “Customize Ribbon” on the left side of the Excel Options window.  When the new window opens,"]
["Look under \"Main Tabs\" on the Right side of the window, and be sure that the box next to \"Developer\" is checked."]
[]
[]
[]
[]
[]
[]
[]
[]
[]
[]
[]
[]
[]
[]
[]
[]
[]
[]
[]
[]
[]
[]
[]
[]
[]
[]
[]
[]
[]
[]
[]
["Then, select “Add‐Ins” on the left side of the Excel Options window.  Near the bottom of the Add-Ins window, next to the \"Excel Add-ins\""]
["dropdown, select the \"Go…\" button."]
[]
[]
[]
[]
[]
[]
[]
[]
[]
[]
[]
[]
[]
{"$rows_left_out":23}